program: Orca
programVersion: 5.0.2
elementType: N C C C C C C C C C C C C C C C C C C C C C H H H H H H H H H H H H H H H H H H H H H H H H H H
charge: 1
multiplicity: 1
keywords: wb97x-d3
keywords: def2-TZVPP
keywords: def2/J RIJCOSX
keywords: DEFGRID2
keywords: scfconv7
keywords: smallprint printgap noloewdin
keywords: NOSOSCF
formula: C21H26N
InChI: InChI=1/C21H26N/c1-21(2,3)15-8-5-9-16-22(4)17-19-13-10-12-18-11-6-7-14-20(18)19/h5-7,9-14,22H,16-17H2,1-4H3
48 atoms
N  2.26923 -1.186915 -0.531247
C  3.409954 -0.363976 0.022162
C  2.900191 0.727322 0.907393
C  2.105899 1.777901 0.364426
C  1.518174 2.710365 1.259043
C  -4.739201 -1.989004 -1.114176
C  1.472102 -1.901525 0.540608
C  3.146908 0.677554 2.255848
C  1.864141 1.939208 -1.021696
C  2.721291 -2.111551 -1.59686
C  1.792548 2.615591 2.642534
C  2.608389 1.636587 3.131493
C  0.677391 3.724218 0.748988
C  -4.72766 -2.737172 -2.453322
C  -5.389687 -0.610302 -1.286251
C  -5.509209 -2.802729 -0.064358
C  0.120901 -2.269046 0.032932
C  1.048548 2.935825 -1.486206
C  0.433831 3.828919 -0.59147
C  -3.364076 -1.814193 -0.649801
C  -0.92235 -1.446525 0.212592
C  -2.231237 -1.676767 -0.258788
H  3.964828 0.013961 -0.838622
H  4.064352 -1.048787 0.561782
H  2.065372 -2.762674 0.850817
H  1.399067 -1.212714 1.380548
H  3.762281 -0.116952 2.661665
H  2.371131 1.315593 -1.751099
H  3.434061 -2.81808 -1.17836
H  3.197674 -1.544977 -2.393036
H  1.866921 -2.648586 -1.999392
H  1.349767 3.341044 3.313368
H  2.827971 1.579787 4.188313
H  0.230162 4.427679 1.439905
H  -5.749877 -2.874823 -2.807864
H  -4.270805 -3.721808 -2.355368
H  -4.180977 -2.181166 -3.214896
H  -4.859856 -0.008867 -2.024873
H  -6.419457 -0.728435 -1.625847
H  -5.406883 -0.058567 -0.346593
H  -5.532429 -2.290878 0.897373
H  -6.538705 -2.945135 -0.395476
H  -5.063858 -3.786133 0.084027
H  -0.010636 -3.212689 -0.481799
H  0.886935 3.048018 -2.549789
H  -0.210888 4.609874 -0.969957
H  -0.771872 -0.517509 0.760666
H  1.610855 -0.526444 -0.955107
totalener: -870.41641871 hartree
nucrepener: 1675.81576069 hartree
electener: -2546.23217940 hartree
oneelecener: -4483.39528025 hartree
twoeener: 1937.16310085 hartree
kineticenergy: 866.24011526 hartree
xcener: -89.071780312318 hartree
chargesum: 1.0000000
charge: 0.152023 -0.192380 0.139828 -0.139319 -0.061982 -0.018775 -0.168796 -0.132350 -0.247218 -0.169983 -0.072134 -0.097415 -0.032538 -0.256472 -0.257025 -0.254258 -0.162025 -0.094839 -0.115264 -0.142069 -0.179646 0.208199 0.171648 0.143445 0.150050 0.166015 0.127761 0.136147 0.131925 0.130843 0.140385 0.132014 0.148786 0.129945 0.099627 0.096390 0.094653 0.094567 0.098940 0.098670 0.100225 0.098334 0.099151 0.135346 0.142731 0.147542 0.119372 0.159926
qa: 0.1520 -0.1924 0.1398 -0.1393 -0.0620 -0.0188 -0.1688 -0.1324 -0.2472 -0.1700 -0.0721 -0.0974 -0.0325 -0.2565 -0.2570 -0.2543 -0.1620 -0.0948 -0.1153 -0.1421 -0.1796 0.2082 0.1716 0.1434 0.1500 0.1660 0.1278 0.1361 0.1319 0.1308 0.1404 0.1320 0.1488 0.1299 0.0996 0.0964 0.0947 0.0946 0.0989 0.0987 0.1002 0.0983 0.0992 0.1353 0.1427 0.1475 0.1194 0.1599
va: 3.5699 3.8339 3.3457 3.9486 4.0054 4.1348 3.9071 3.9765 3.9476 3.8520 3.9820 3.9817 3.9200 3.8971 3.8969 3.8963 3.7766 4.0356 3.9957 3.9701 4.0553 3.7194 0.9803 1.0086 1.0075 0.9970 1.0096 1.0100 0.9967 0.9997 0.9993 1.0092 0.9975 1.0096 1.0075 1.0080 1.0075 1.0079 1.0071 1.0078 1.0077 1.0062 1.0078 1.0140 1.0007 0.9970 1.0025 1.0355
dispersion: -0.021519225 hartree
energy: -870.437937932595 hartree
dipole: -15.22631 17.65757 2.43126 -15.71299 14.60223 -1.11076 -9.30745 8.75621 -0.55124
magnitude: 2.72923 au
magnitude: 6.93714 debye
