program: Orca
programVersion: 5.0.2
elementType: N C C C C C C C C C C C C C C C C C C C C C H H H H H H H H H H H H H H H H H H H H H H H H H H
charge: 1
multiplicity: 1
keywords: wb97x-d3
keywords: def2-TZVPP
keywords: def2/J RIJCOSX
keywords: DEFGRID2
keywords: scfconv7
keywords: smallprint printgap noloewdin
keywords: NOSOSCF
formula: C21H26N
InChI: InChI=1/C21H26N/c1-21(2,3)15-8-5-9-16-22(4)17-19-13-10-12-18-11-6-7-14-20(18)19/h5-7,9-14,22H,16-17H2,1-4H3
48 atoms
N  2.260882 -1.12435 -0.631631
C  3.404497 -0.335449 -0.036223
C  2.903704 0.690201 0.929026
C  2.096354 1.771216 0.472311
C  1.521538 2.638765 1.43791
C  -4.741693 -1.969302 -1.231475
C  1.476502 -1.910637 0.398649
C  3.173434 0.549609 2.266572
C  1.829119 2.024701 -0.895175
C  2.707301 -1.975397 -1.759336
C  1.819545 2.451063 2.806862
C  2.646266 1.444383 3.214328
C  0.669882 3.682137 1.012567
C  -5.167283 -3.435411 -1.079446
C  -4.787418 -1.559857 -2.710399
C  -5.66716 -1.064421 -0.409139
C  0.126855 -2.261683 -0.123761
C  1.002136 3.046806 -1.276755
C  0.402749 3.876701 -0.313227
C  -3.370492 -1.817838 -0.747298
C  -0.929005 -1.474075 0.125995
C  -2.236963 -1.691587 -0.354241
H  3.947041 0.102855 -0.87618
H  4.068182 -1.052762 0.446879
H  2.080676 -2.782423 0.653762
H  1.401403 -1.274009 1.278466
H  3.797746 -0.268402 2.606768
H  2.324954 1.454466 -1.674247
H  3.429599 -2.701716 -1.394367
H  3.171412 -1.35564 -2.522705
H  1.852474 -2.491862 -2.186996
H  1.386514 3.127387 3.533066
H  2.884018 1.316931 4.260968
H  0.233868 4.335693 1.75749
H  -6.190351 -3.559812 -1.436554
H  -5.134203 -3.753179 -0.037658
H  -4.525508 -4.099034 -1.658494
H  -4.137423 -2.188771 -3.318454
H  -5.805465 -1.663435 -3.08784
H  -4.483189 -0.52205 -2.845494
H  -5.647573 -1.330207 0.647483
H  -5.383276 -0.016225 -0.501193
H  -6.693828 -1.167289 -0.762751
H  0.006126 -3.166002 -0.707751
H  0.82159 3.229956 -2.327368
H  -0.25073 4.678833 -0.626751
H  -0.790674 -0.58738 0.7433
H  1.597092 -0.439768 -1.00574
totalener: -870.41653718 hartree
nucrepener: 1674.56608377 hartree
electener: -2544.98262095 hartree
oneelecener: -4480.89690990 hartree
twoeener: 1935.91428895 hartree
kineticenergy: 866.23948543 hartree
xcener: -89.071722619702 hartree
chargesum: 1.0000000
charge: 0.153098 -0.192759 0.135188 -0.135825 -0.062228 -0.019959 -0.167148 -0.127567 -0.249617 -0.169938 -0.070626 -0.099110 -0.032644 -0.252473 -0.256967 -0.255877 -0.163040 -0.094061 -0.115755 -0.144953 -0.175269 0.208838 0.171159 0.143872 0.149888 0.164483 0.127342 0.135772 0.131602 0.131274 0.140028 0.131874 0.148642 0.130107 0.098538 0.101192 0.094311 0.095109 0.100042 0.096571 0.099860 0.095125 0.098178 0.134730 0.142570 0.147502 0.119598 0.159329
qa: 0.1531 -0.1928 0.1352 -0.1358 -0.0622 -0.0200 -0.1671 -0.1276 -0.2496 -0.1699 -0.0706 -0.0991 -0.0326 -0.2525 -0.2570 -0.2559 -0.1630 -0.0941 -0.1158 -0.1450 -0.1753 0.2088 0.1712 0.1439 0.1499 0.1645 0.1273 0.1358 0.1316 0.1313 0.1400 0.1319 0.1486 0.1301 0.0985 0.1012 0.0943 0.0951 0.1000 0.0966 0.0999 0.0951 0.0982 0.1347 0.1426 0.1475 0.1196 0.1593
va: 3.5708 3.8327 3.3504 3.9492 4.0090 4.1355 3.9067 3.9755 3.9489 3.8523 3.9818 3.9831 3.9201 3.8939 3.8969 3.8961 3.7820 4.0342 3.9973 3.9699 4.0546 3.7169 0.9806 1.0085 1.0072 0.9980 1.0096 1.0100 0.9967 0.9996 0.9996 1.0092 0.9975 1.0097 1.0068 1.0074 1.0087 1.0080 1.0071 1.0074 1.0080 1.0081 1.0069 1.0141 1.0008 0.9970 1.0025 1.0356
dispersion: -0.021470381 hartree
energy: -870.438007556707 hartree
dipole: -15.20618 17.63756 2.43138 -15.19150 14.15485 -1.03665 -10.42773 9.77050 -0.65723
magnitude: 2.72364 au
magnitude: 6.92293 debye
