program: Orca
programVersion: 5.0.2
elementType: N C C C C C C C C C C C C C C C C C C C C C H H H H H H H H H H H H H H H H H H H H H H H H H H
charge: 1
multiplicity: 1
keywords: wb97x-d3
keywords: def2-TZVPP
keywords: def2/J RIJCOSX
keywords: DEFGRID2
keywords: scfconv7
keywords: smallprint printgap noloewdin
keywords: NOSOSCF
formula: C21H26N
InChI: InChI=1/C21H26N/c1-21(2,3)15-8-5-9-16-22(4)17-19-13-10-12-18-11-6-7-14-20(18)19/h5-7,9-14,22H,16-17H2,1-4H3
48 atoms
N  2.252471 -1.178001 -0.517424
C  3.40002 -0.363979 0.034885
C  2.903847 0.738492 0.913797
C  2.129359 1.800276 0.363977
C  1.564565 2.753047 1.251946
C  -4.75812 -2.033311 -1.119352
C  1.447491 -1.880725 0.556217
C  3.151135 0.693822 2.262312
C  1.886611 1.95453 -1.0227
C  2.700393 -2.111494 -1.57726
C  1.83946 2.663565 2.635643
C  2.633108 1.669902 3.131403
C  0.746822 3.782153 0.735151
C  -4.738736 -2.217301 -2.642822
C  -5.588042 -0.797748 -0.749592
C  -5.347104 -3.281895 -0.449245
C  0.101408 -2.260635 0.044183
C  1.091972 2.9648 -1.493742
C  0.502274 3.880956 -0.605511
C  -3.386459 -1.84634 -0.648503
C  -0.950704 -1.4484 0.218501
C  -2.255654 -1.69277 -0.257159
H  3.960676 0.004252 -0.826368
H  4.046062 -1.053462 0.578609
H  2.041135 -2.735937 0.88199
H  1.366434 -1.181222 1.386631
H  3.751316 -0.10955 2.673351
H  2.376642 1.313246 -1.748353
H  3.399909 -2.826523 -1.150884
H  3.19154 -1.553274 -2.37037
H  1.842431 -2.637792 -1.986131
H  1.415159 3.40478 3.301187
H  2.853517 1.617068 4.188232
H  0.317848 4.501746 1.421025
H  -4.316197 -1.346489 -3.143991
H  -5.757047 -2.354165 -3.008637
H  -4.157637 -3.09304 -2.930983
H  -5.186462 0.10402 -1.211623
H  -6.614498 -0.924504 -1.095954
H  -5.613779 -0.644668 0.329061
H  -4.773012 -4.174765 -0.695642
H  -5.368493 -3.179344 0.635398
H  -6.371088 -3.433216 -0.793039
H  -0.019788 -3.207421 -0.467361
H  0.929971 3.071238 -2.557844
H  -0.125706 4.672912 -0.98918
H  -0.810815 -0.516049 0.763807
H  1.601176 -0.513744 -0.946022
totalener: -870.41660693 hartree
nucrepener: 1672.43393705 hartree
electener: -2542.85054398 hartree
oneelecener: -4476.64295683 hartree
twoeener: 1933.79241285 hartree
kineticenergy: 866.23916585 hartree
xcener: -89.071616241395 hartree
chargesum: 1.0000000
charge: 0.152676 -0.192433 0.134568 -0.135167 -0.062483 -0.020994 -0.167497 -0.129271 -0.247640 -0.170682 -0.071545 -0.098341 -0.032294 -0.256391 -0.255999 -0.252640 -0.163768 -0.095486 -0.115653 -0.144250 -0.175894 0.208851 0.171992 0.143605 0.149947 0.165053 0.127327 0.135419 0.132295 0.130848 0.140338 0.131945 0.148717 0.129967 0.095529 0.100079 0.095632 0.094260 0.098444 0.099377 0.096512 0.101080 0.098566 0.135366 0.142684 0.147698 0.119413 0.160240
qa: 0.1527 -0.1924 0.1346 -0.1352 -0.0625 -0.0210 -0.1675 -0.1293 -0.2476 -0.1707 -0.0715 -0.0983 -0.0323 -0.2564 -0.2560 -0.2526 -0.1638 -0.0955 -0.1157 -0.1442 -0.1759 0.2089 0.1720 0.1436 0.1499 0.1651 0.1273 0.1354 0.1323 0.1308 0.1403 0.1319 0.1487 0.1300 0.0955 0.1001 0.0956 0.0943 0.0984 0.0994 0.0965 0.1011 0.0986 0.1354 0.1427 0.1477 0.1194 0.1602
va: 3.5707 3.8296 3.3466 3.9552 4.0111 4.1375 3.9050 3.9742 3.9496 3.8521 3.9816 3.9822 3.9201 3.8962 3.8963 3.8937 3.7813 4.0353 3.9964 3.9708 4.0558 3.7189 0.9803 1.0086 1.0073 0.9977 1.0096 1.0101 0.9965 0.9998 0.9994 1.0092 0.9976 1.0096 1.0075 1.0072 1.0083 1.0081 1.0070 1.0079 1.0084 1.0075 1.0066 1.0138 1.0008 0.9970 1.0025 1.0344
dispersion: -0.021405374 hartree
energy: -870.438012300970 hartree
dipole: -15.37450 17.79035 2.41585 -15.94800 14.84169 -1.10631 -9.32205 8.77819 -0.54386
magnitude: 2.71220 au
magnitude: 6.89386 debye
