program: Orca
programVersion: 5.0.2
elementType: N C C C C C C C C C C C C C C C C C C C C C H H H H H H H H H H H H H H H H H H H H H H H H H H
charge: 1
multiplicity: 1
keywords: wb97x-d3
keywords: def2-TZVPP
keywords: def2/J RIJCOSX
keywords: DEFGRID2
keywords: scfconv7
keywords: smallprint printgap noloewdin
keywords: NOSOSCF
formula: C21H26N
InChI: InChI=1/C21H26N/c1-21(2,3)15-8-5-9-16-22(4)17-19-13-10-12-18-11-6-7-14-20(18)19/h5-7,9-14,22H,16-17H2,1-4H3
48 atoms
N  2.062772 -1.133254 -0.512114
C  3.279886 -0.411509 0.018578
C  2.899528 0.72801 0.90683
C  2.248636 1.873828 0.365887
C  1.822112 2.891341 1.259521
C  -4.912015 -2.310392 -1.147049
C  1.247816 -1.790254 0.58138
C  3.154635 0.651384 2.252478
C  2.004064 2.054587 -1.016895
C  2.423839 -2.085193 -1.589379
C  2.100394 2.767461 2.639756
C  2.767153 1.680828 3.127608
C  1.139084 4.018366 0.751719
C  -4.82409 -3.419453 -2.202823
C  -5.509131 -1.040626 -1.767575
C  -5.778879 -2.775263 0.031549
C  -0.082884 -2.222988 0.074486
C  1.342896 3.160503 -1.479294
C  0.892427 4.147896 -0.585803
C  -3.56877 -2.011811 -0.652797
C  -1.169339 -1.453233 0.227472
C  -2.457331 -1.778179 -0.246083
H  3.852392 -0.087668 -0.852539
H  3.878457 -1.152528 0.548746
H  1.85004 -2.619316 0.956939
H  1.148618 -1.050837 1.37497
H  3.663755 -0.216489 2.65529
H  2.38769 1.350148 -1.747755
H  3.068083 -2.85919 -1.178871
H  2.951378 -1.556465 -2.379192
H  1.523953 -2.535731 -1.997725
H  1.782411 3.556545 3.30939
H  2.990913 1.600107 4.181954
H  0.816834 4.78753 1.442107
H  -5.821421 -3.655624 -2.575628
H  -4.396562 -4.331358 -1.786441
H  -4.213244 -3.112213 -3.051668
H  -4.908002 -0.685522 -2.604539
H  -6.512245 -1.251179 -2.14042
H  -5.583531 -0.236607 -1.035817
H  -5.373301 -3.674494 0.494568
H  -5.858126 -2.004176 0.797332
H  -6.784723 -3.003404 -0.323373
H  -0.167677 -3.186129 -0.413832
H  1.178457 3.284587 -2.541099
H  0.369501 5.015609 -0.963126
H  -1.078181 -0.506727 0.757829
H  1.448574 -0.421779 -0.918723
totalener: -870.41714112 hartree
nucrepener: 1656.30948317 hartree
electener: -2526.72662429 hartree
oneelecener: -4444.44318894 hartree
twoeener: 1917.71656464 hartree
kineticenergy: 866.24149350 hartree
xcener: -89.072048979776 hartree
chargesum: 1.0000000
charge: 0.157587 -0.194079 0.113526 -0.124626 -0.060215 -0.015901 -0.161415 -0.118293 -0.242769 -0.175831 -0.069800 -0.102487 -0.033304 -0.258423 -0.256634 -0.253868 -0.172259 -0.102574 -0.114833 -0.148252 -0.161888 0.200690 0.172195 0.146796 0.149830 0.162235 0.126082 0.132832 0.134553 0.131061 0.141078 0.131660 0.148387 0.129763 0.099085 0.096813 0.093596 0.095225 0.099206 0.098973 0.099778 0.099567 0.098002 0.136585 0.142142 0.147419 0.120178 0.162607
qa: 0.1576 -0.1941 0.1135 -0.1246 -0.0602 -0.0159 -0.1614 -0.1183 -0.2428 -0.1758 -0.0698 -0.1025 -0.0333 -0.2584 -0.2566 -0.2539 -0.1723 -0.1026 -0.1148 -0.1483 -0.1619 0.2007 0.1722 0.1468 0.1498 0.1622 0.1261 0.1328 0.1346 0.1311 0.1411 0.1317 0.1484 0.1298 0.0991 0.0968 0.0936 0.0952 0.0992 0.0990 0.0998 0.0996 0.0980 0.1366 0.1421 0.1474 0.1202 0.1626
va: 3.5740 3.8146 3.3470 3.9784 4.0273 4.1304 3.8926 3.9677 3.9626 3.8532 3.9810 3.9866 3.9212 3.8995 3.8978 3.8961 3.7991 4.0439 3.9960 3.9790 4.0675 3.7182 0.9810 1.0083 1.0063 1.0002 1.0098 1.0105 0.9952 1.0003 0.9993 1.0094 0.9980 1.0099 1.0078 1.0078 1.0077 1.0075 1.0067 1.0077 1.0073 1.0078 1.0062 1.0118 1.0011 0.9971 1.0028 1.0270
dispersion: -0.020955302 hartree
energy: -870.438096424577 hartree
dipole: -16.60781 18.85717 2.24936 -17.20843 16.15778 -1.05065 -9.49078 8.94763 -0.54316
magnitude: 2.54136 au
magnitude: 6.45962 debye
