program: Orca
programVersion: 5.0.2
elementType: N C C C C C C C C C C C C C C C C C C C C C H H H H H H H H H H H H H H H H H H H H H H H H H H
charge: 1
multiplicity: 1
keywords: wb97x-d3
keywords: def2-TZVPP
keywords: def2/J RIJCOSX
keywords: DEFGRID2
keywords: scfconv7
keywords: smallprint printgap noloewdin
keywords: NOSOSCF
formula: C21H26N
InChI: InChI=1/C21H26N/c1-21(2,3)15-8-5-9-16-22(4)17-19-13-10-12-18-11-6-7-14-20(18)19/h5-7,9-14,22H,16-17H2,1-4H3
48 atoms
N  1.842576 -0.654559 -0.997599
C  1.705193 -0.438319 0.493018
C  1.484638 1.005138 0.807649
C  2.521666 1.95415 0.576475
C  2.237982 3.329516 0.783674
C  -4.821365 -3.381305 0.003175
C  0.564841 -0.37404 -1.763905
C  0.268767 1.418145 1.2892
C  3.825879 1.597656 0.155256
C  2.402893 -1.994133 -1.30081
C  0.965044 3.711641 1.264256
C  0.006343 2.777621 1.533249
C  3.239296 4.290915 0.522726
C  -4.732192 -4.662783 -0.834187
C  -6.12459 -2.637048 -0.314721
C  -4.764477 -3.725481 1.49822
C  -0.522245 -1.336127 -1.451966
C  4.777532 2.552648 -0.082711
C  4.479013 3.915699 0.088015
C  -3.687486 -2.516393 -0.318314
C  -1.661175 -0.952258 -0.860607
C  -2.746249 -1.809692 -0.582348
H  2.617538 -0.830675 0.94564
H  0.873832 -1.059585 0.823906
H  0.280032 0.649822 -1.524551
H  0.846868 -0.408166 -2.818326
H  -0.50459 0.686984 1.49319
H  4.119924 0.555998 0.075763
H  1.767635 -2.759625 -0.864507
H  3.39993 -2.07068 -0.874389
H  2.457603 -2.133638 -2.37767
H  0.762824 4.762393 1.429382
H  -0.957005 3.075735 1.922659
H  3.01141 5.337417 0.6809
H  -3.811778 -5.209838 -0.629831
H  -4.768445 -4.443562 -1.9011
H  -5.571488 -5.317579 -0.59712
H  -6.978422 -3.272762 -0.07726
H  -6.212873 -1.721629 0.269626
H  -6.184669 -2.374412 -1.370515
H  -4.830994 -2.830413 2.11623
H  -5.601213 -4.375781 1.756302
H  -3.842556 -4.248513 1.752372
H  -0.415847 -2.363011 -1.781851
H  5.772424 2.257129 -0.387348
H  5.238271 4.660314 -0.106302
H  -1.784865 0.090437 -0.576229
H  2.517329 0.041234 -1.324895
totalener: -870.41637994 hartree
nucrepener: 1652.71302590 hartree
electener: -2523.12940584 hartree
oneelecener: -4437.22268510 hartree
twoeener: 1914.09327926 hartree
kineticenergy: 866.24562572 hartree
xcener: -89.075457307878 hartree
chargesum: 1.0000000
charge: 0.175775 -0.228310 0.128476 -0.102002 -0.056325 -0.019037 -0.174654 -0.167297 -0.268778 -0.193510 -0.077681 -0.099788 -0.028549 -0.256839 -0.255012 -0.256787 -0.139816 -0.101058 -0.115522 -0.139450 -0.219723 0.218290 0.178788 0.166846 0.160980 0.160689 0.154036 0.138257 0.135512 0.131653 0.142022 0.130973 0.146495 0.129482 0.092142 0.100345 0.098737 0.098467 0.097529 0.100671 0.098393 0.099688 0.095287 0.131267 0.142123 0.147021 0.128913 0.171279
qa: 0.1758 -0.2283 0.1285 -0.1020 -0.0563 -0.0190 -0.1747 -0.1673 -0.2688 -0.1935 -0.0777 -0.0998 -0.0285 -0.2568 -0.2550 -0.2568 -0.1398 -0.1011 -0.1155 -0.1394 -0.2197 0.2183 0.1788 0.1668 0.1610 0.1607 0.1540 0.1383 0.1355 0.1317 0.1420 0.1310 0.1465 0.1295 0.0921 0.1003 0.0987 0.0985 0.0975 0.1007 0.0984 0.0997 0.0953 0.1313 0.1421 0.1470 0.1289 0.1713
va: 3.5450 3.8492 3.3283 3.9841 4.0318 4.1306 3.9120 3.9937 3.9634 3.8729 3.9938 3.9916 3.9164 3.8972 3.8961 3.8977 3.7739 4.0422 3.9995 3.9707 4.0598 3.6943 0.9766 0.9961 0.9895 0.9916 0.9901 1.0114 0.9932 1.0023 0.9927 1.0096 0.9997 1.0097 1.0083 1.0070 1.0075 1.0064 1.0083 1.0074 1.0077 1.0072 1.0071 1.0124 1.0013 0.9973 0.9968 1.0078
dispersion: -0.021606091 hartree
energy: -870.437986036220 hartree
dipole: -16.76305 18.86306 2.10000 -21.87199 21.27598 -0.59601 -3.71829 2.66700 -1.05129
magnitude: 2.42290 au
magnitude: 6.15852 debye
