program: Orca
programVersion: 5.0.2
elementType: N C C C C C C C C C C C C C C C C C C C C C H H H H H H H H H H H H H H H H H H H H H H H H H H
charge: 1
multiplicity: 1
keywords: wb97x-d3
keywords: def2-TZVPP
keywords: def2/J RIJCOSX
keywords: DEFGRID2
keywords: scfconv7
keywords: smallprint printgap noloewdin
keywords: NOSOSCF
formula: C21H26N
InChI: InChI=1/C21H26N/c1-21(2,3)15-8-5-9-16-22(4)17-19-13-10-12-18-11-6-7-14-20(18)19/h5-7,9-14,22H,16-17H2,1-4H3
48 atoms
N  1.554284 -1.015778 0.301704
C  2.654144 -0.509624 1.207409
C  3.148763 0.824015 0.751915
C  2.307362 1.96885 0.859911
C  2.770821 3.199958 0.326575
C  -5.184848 -2.522218 -1.406835
C  0.787929 -2.163853 0.918674
C  4.395947 0.935087 0.19209
C  1.029248 1.944078 1.468624
C  2.054539 -1.340396 -1.057135
C  4.061191 3.267459 -0.246452
C  4.865195 2.165458 -0.300531
C  1.937614 4.338893 0.386145
C  -5.371939 -4.012929 -1.71823
C  -5.161801 -1.713462 -2.711375
C  -6.318589 -2.024983 -0.501507
C  -0.451594 -2.465943 0.154159
C  0.245113 3.065322 1.512107
C  0.696696 4.27414 0.954496
C  -3.9089 -2.339775 -0.718375
C  -1.64019 -1.974237 0.529788
C  -2.852402 -2.189368 -0.156195
H  3.443495 -1.261289 1.200008
H  2.238146 -0.477913 2.215573
H  1.476225 -3.009217 0.962742
H  0.556713 -1.863701 1.941364
H  5.03653 0.06339 0.125111
H  0.665185 1.04977 1.96367
H  2.578024 -0.47995 -1.463084
H  1.215215 -1.589359 -1.699461
H  2.733401 -2.187716 -0.990362
H  4.409011 4.214252 -0.639996
H  5.855727 2.228027 -0.728478
H  2.30048 5.272561 -0.024668
H  -6.32034 -4.162903 -2.235466
H  -5.386749 -4.611381 -0.80783
H  -4.575418 -4.38862 -2.360234
H  -6.107588 -1.843582 -3.238795
H  -5.029071 -0.649083 -2.518112
H  -4.360466 -2.04332 -3.372298
H  -6.353578 -2.582598 0.433975
H  -6.203231 -0.967679 -0.263847
H  -7.277159 -2.153472 -1.005684
H  -0.383346 -3.107263 -0.715735
H  -0.723193 3.026848 1.992539
H  0.067243 5.152198 0.993522
H  -1.704249 -1.369902 1.433286
H  0.884128 -0.248315 0.195921
totalener: -870.41719760 hartree
nucrepener: 1631.44285941 hartree
electener: -2501.86005701 hartree
oneelecener: -4394.66811942 hartree
twoeener: 1892.80806241 hartree
kineticenergy: 866.24606704 hartree
xcener: -89.072694043817 hartree
chargesum: 1.0000000
charge: 0.159153 -0.174809 0.062388 -0.089127 -0.049965 -0.022380 -0.148018 -0.124735 -0.245487 -0.206903 -0.074130 -0.096808 -0.033668 -0.252593 -0.256425 -0.255046 -0.153564 -0.101840 -0.114765 -0.155994 -0.161695 0.204862 0.147088 0.167733 0.151845 0.134762 0.127355 0.129971 0.157210 0.145614 0.132752 0.130830 0.148004 0.129198 0.098606 0.101374 0.094772 0.099804 0.097584 0.095252 0.100277 0.095752 0.098165 0.139759 0.140238 0.146910 0.113260 0.167434
qa: 0.1592 -0.1748 0.0624 -0.0891 -0.0500 -0.0224 -0.1480 -0.1247 -0.2455 -0.2069 -0.0741 -0.0968 -0.0337 -0.2526 -0.2564 -0.2550 -0.1536 -0.1018 -0.1148 -0.1560 -0.1617 0.2049 0.1471 0.1677 0.1518 0.1348 0.1274 0.1300 0.1572 0.1456 0.1328 0.1308 0.1480 0.1292 0.0986 0.1014 0.0948 0.0998 0.0976 0.0953 0.1003 0.0958 0.0982 0.1398 0.1402 0.1469 0.1133 0.1674
va: 3.5639 3.8216 3.4225 3.9884 4.0296 4.1386 3.8940 3.9818 3.9652 3.8607 3.9875 3.9803 3.9229 3.8935 3.8960 3.8956 3.7953 4.0452 3.9987 3.9830 4.0752 3.7126 1.0087 0.9855 1.0030 1.0069 1.0089 1.0111 0.9929 0.9994 0.9969 1.0098 0.9981 1.0100 1.0068 1.0076 1.0085 1.0072 1.0073 1.0078 1.0080 1.0079 1.0070 1.0107 1.0018 0.9973 1.0049 1.0201
dispersion: -0.020625805 hartree
energy: -870.437823404592 hartree
dipole: -19.77787 21.57612 1.79826 -16.91576 16.06470 -0.85106 -8.14758 8.22518 0.07760
magnitude: 1.99099 au
magnitude: 5.06070 debye
