program: Orca
programVersion: 5.0.2
elementType: N C C C C C C C C C C C C C C C C C C C C C H H H H H H H H H H H H H H H H H H H H H H H H H H
charge: 1
multiplicity: 1
keywords: wb97x-d3
keywords: def2-TZVPP
keywords: def2/J RIJCOSX
keywords: DEFGRID2
keywords: scfconv7
keywords: smallprint printgap noloewdin
keywords: NOSOSCF
formula: C21H26N
InChI: InChI=1/C21H26N/c1-21(2,3)15-8-5-9-16-22(4)17-19-13-10-12-18-11-6-7-14-20(18)19/h5-7,9-14,22H,16-17H2,1-4H3
48 atoms
N  1.074903 -0.171797 -0.644498
C  0.507587 1.05496 0.035053
C  1.496719 1.647827 0.984231
C  2.668533 2.288489 0.489534
C  3.630562 2.750814 1.425301
C  -5.405365 -3.361596 -0.589903
C  0.249951 -0.597934 -1.841597
C  1.289999 1.535952 2.335436
C  2.926151 2.489029 -0.888218
C  1.300272 -1.286304 0.30875
C  3.380097 2.607354 2.808908
C  2.229346 2.027128 3.258756
C  4.816927 3.356925 0.957014
C  -5.357182 -4.64037 0.256386
C  -6.14495 -3.634489 -1.90756
C  -6.111211 -2.242008 0.185122
C  -1.150526 -0.940765 -1.484329
C  4.084517 3.083405 -1.311085
C  5.047351 3.511924 -0.380717
C  -4.040193 -2.940655 -0.899742
C  -1.592197 -2.205079 -1.458189
C  -2.91647 -2.582612 -1.15327
H  -0.400743 0.739587 0.546139
H  0.220025 1.745996 -0.759514
H  0.294669 0.235151 -2.545916
H  0.770847 -1.444765 -2.289662
H  0.389364 1.059218 2.704438
H  2.1849 2.228465 -1.636649
H  0.344195 -1.6083 0.711664
H  1.948416 -0.946548 1.110715
H  1.770944 -2.113733 -0.215918
H  4.116284 2.973178 3.513493
H  2.038627 1.933403 4.31857
H  5.544904 3.704831 1.678927
H  -4.828837 -4.477661 1.195677
H  -4.862816 -5.452008 -0.276684
H  -6.37194 -4.96223 0.493622
H  -5.661212 -4.425729 -2.479505
H  -7.166912 -3.949613 -1.693289
H  -6.191435 -2.742262 -2.531423
H  -5.603555 -2.027005 1.125496
H  -6.155058 -1.321841 -0.397293
H  -7.133815 -2.541517 0.417621
H  -1.841652 -0.129058 -1.291069
H  4.2544 3.2407 -2.367653
H  5.959064 3.978149 -0.727382
H  -0.903625 -3.01436 -1.693058
H  1.992481 0.103284 -1.003802
totalener: -870.41680290 hartree
nucrepener: 1617.45411958 hartree
electener: -2487.87092248 hartree
oneelecener: -4366.77452099 hartree
twoeener: 1878.90359851 hartree
kineticenergy: 866.24872302 hartree
xcener: -89.074851731436 hartree
chargesum: 1.0000000
charge: 0.177226 -0.176938 0.038617 -0.084237 -0.045365 -0.020885 -0.140939 -0.122348 -0.266859 -0.231552 -0.073075 -0.098522 -0.033817 -0.254787 -0.253548 -0.258442 -0.171406 -0.102757 -0.115189 -0.144846 -0.162064 0.199977 0.148093 0.175126 0.148743 0.145555 0.127540 0.139914 0.145626 0.164325 0.141346 0.131291 0.147487 0.129445 0.094888 0.100171 0.098851 0.101091 0.098342 0.099213 0.093634 0.096352 0.099453 0.136640 0.142348 0.147121 0.118239 0.170925
qa: 0.1772 -0.1769 0.0386 -0.0842 -0.0454 -0.0209 -0.1409 -0.1223 -0.2669 -0.2316 -0.0731 -0.0985 -0.0338 -0.2548 -0.2535 -0.2584 -0.1714 -0.1028 -0.1152 -0.1448 -0.1621 0.2000 0.1481 0.1751 0.1487 0.1456 0.1275 0.1399 0.1456 0.1643 0.1413 0.1313 0.1475 0.1294 0.0949 0.1002 0.0989 0.1011 0.0983 0.0992 0.0936 0.0964 0.0995 0.1366 0.1423 0.1471 0.1182 0.1709
va: 3.5276 3.8326 3.4490 3.9768 4.0256 4.1319 3.8829 3.9792 3.9776 3.8839 3.9852 3.9813 3.9224 3.8968 3.8952 3.8988 3.7775 4.0444 3.9972 3.9669 4.0468 3.7072 1.0032 0.9759 1.0035 1.0001 1.0088 1.0095 0.9901 0.9907 0.9960 1.0097 0.9983 1.0099 1.0077 1.0076 1.0069 1.0078 1.0062 1.0074 1.0075 1.0078 1.0079 1.0153 1.0011 0.9972 1.0041 1.0056
dispersion: -0.020741171 hartree
energy: -870.437544074880 hartree
dipole: -23.76380 25.12279 1.35899 -18.13701 17.92882 -0.20819 -3.87789 3.43638 -0.44152
magnitude: 1.44400 au
magnitude: 3.67035 debye
