program: Orca
programVersion: 5.0.2
elementType: N C C C C C C C C C C C C C C C C C C C C C H H H H H H H H H H H H H H H H H H H H H H H H H H
charge: 1
multiplicity: 1
keywords: wb97x-d3
keywords: def2-TZVPP
keywords: def2/J RIJCOSX
keywords: DEFGRID2
keywords: scfconv7
keywords: smallprint printgap noloewdin
keywords: NOSOSCF
formula: C21H26N
InChI: InChI=1/C21H26N/c1-21(2,3)15-8-5-9-16-22(4)17-19-13-10-12-18-11-6-7-14-20(18)19/h5-7,9-14,22H,16-17H2,1-4H3
48 atoms
N  2.323772 -1.210766 -0.366839
C  1.843514 -0.748246 0.982497
C  2.267321 0.652436 1.296005
C  1.583184 1.771995 0.736451
C  2.044542 3.07868 1.052808
C  -4.779684 -1.927745 -1.118922
C  1.610805 -2.462125 -0.802614
C  3.325605 0.856053 2.144653
C  0.456705 1.649569 -0.113867
C  3.793836 -1.397611 -0.402055
C  3.144754 3.239022 1.926573
C  3.766744 2.152249 2.470086
C  1.389104 4.201847 0.49833
C  -4.995123 -0.423026 -0.917143
C  -5.634369 -2.717202 -0.121961
C  -5.156211 -2.320259 -2.552005
C  0.184217 -2.186486 -1.120779
C  -0.160597 2.756245 -0.630279
C  0.311719 4.047551 -0.328159
C  -3.365007 -2.233927 -0.892247
C  -0.8262 -2.70729 -0.419407
C  -2.194613 -2.458075 -0.700808
H  2.250426 -1.453724 1.705618
H  0.76048 -0.857305 0.991079
H  2.141643 -2.823958 -1.683334
H  1.726969 -3.192377 -0.002151
H  3.832494 0.001985 2.577952
H  0.052895 0.675439 -0.359694
H  4.088806 -1.664599 -1.412797
H  4.064458 -2.192104 0.288478
H  4.284807 -0.472493 -0.115816
H  3.481545 4.240928 2.164617
H  4.601001 2.277998 3.147148
H  1.753816 5.191564 0.745599
H  -6.044181 -0.171403 -1.084191
H  -4.394313 0.162637 -1.614431
H  -4.73373 -0.114958 0.09621
H  -6.691291 -2.494399 -0.2800
H  -5.496503 -3.792601 -0.242847
H  -5.387585 -2.458465 0.908625
H  -4.561152 -1.774066 -3.285161
H  -5.009922 -3.387382 -2.724487
H  -6.207857 -2.091277 -2.734687
H  -0.014641 -1.542374 -1.971469
H  -1.021968 2.637184 -1.274784
H  -0.184649 4.913477 -0.745371
H  -0.613963 -3.36468 0.419566
H  2.100139 -0.485257 -1.0546
elementType: N C H
totalener: -870.50839514 hartree
nucrepener: 1661.83507175 hartree
electener: -2532.34346688 hartree
oneelecener: -4455.01514526 hartree
twoeener: 1922.67167837 hartree
cpcmener: -0.09728997 hartree
kineticenergy: 866.20918181 hartree
xcener: -89.066329425503 hartree
chargesum: 1.0000000
charge: 0.207261 -0.139949 0.034620 -0.064255 -0.042105 0.059441 -0.057965 -0.150070 -0.214696 -0.199011 -0.123069 -0.127245 -0.091052 -0.289792 -0.288421 -0.287050 -0.171598 -0.155989 -0.146047 -0.255053 -0.214086 0.236943 0.149941 0.180970 0.142399 0.137329 0.145247 0.157402 0.139891 0.140430 0.142491 0.145507 0.159224 0.144157 0.099012 0.100806 0.101682 0.098519 0.101467 0.100927 0.100306 0.102274 0.099052 0.148423 0.156385 0.159478 0.146233 0.179636
qa: 0.2073 -0.1399 0.0346 -0.0643 -0.0421 0.0594 -0.0580 -0.1501 -0.2147 -0.1990 -0.1231 -0.1272 -0.0911 -0.2898 -0.2884 -0.2871 -0.1716 -0.1560 -0.1460 -0.2551 -0.2141 0.2369 0.1499 0.1810 0.1424 0.1373 0.1452 0.1574 0.1399 0.1404 0.1425 0.1455 0.1592 0.1442 0.0990 0.1008 0.1017 0.0985 0.1015 0.1009 0.1003 0.1023 0.0991 0.1484 0.1564 0.1595 0.1462 0.1796
va: 3.6185 3.8001 3.4322 3.9012 3.9090 4.0321 3.8688 3.9270 3.9312 3.8660 3.9370 3.8997 3.8784 3.8959 3.8943 3.8918 3.8639 3.9637 3.9103 4.0704 3.9989 3.6664 1.0076 0.9738 0.9950 1.0022 1.0018 0.9913 0.9966 0.9938 0.9918 1.0036 0.9904 1.0047 1.0036 1.0054 1.0056 1.0033 1.0056 1.0055 1.0058 1.0054 1.0032 1.0056 0.9943 0.9899 0.9979 0.9921
dispersion: -0.021246503 hartree
energy: -870.529641638831 hartree
dipole: -14.31115 18.08853 3.77737 -13.57671 11.63795 -1.93875 -7.00309 6.46534 -0.53775
magnitude: 4.27978 au
magnitude: 10.87833 debye
