program: Gaussian 09
title: 000070880
version: EM64L-G09RevD.01
frameworkgroup: C1[X(C20H38N2)]
method: RPBEPBE
basis: SDD
operation: Freq
keyword: #pfreq=noraman
keyword: PBEPBE/SDD
title: #p freq=noraman PBEPBE/SDD
converged: YES YES NO NO
title: Mulliken charges:
elementType: N N C C C C C C C C C C C C C C C C C C C C H H H H H H H H H H H H H H H H H H H H H H H H H H H H H H H H H H H H H H
charge: -0.333322 -0.333326 0.001105 0.001080 -0.442551 -0.461015 -0.442541 -0.461043 -0.438275 -0.438325 0.025223 0.025247 -0.460195 -0.419250 -0.460227 -0.419232 -0.394954 -0.396481 -0.394945 -0.396479 -0.385037 -0.385032 0.175221 0.175252 0.177338 0.232183 0.193642 0.190832 0.177328 0.232181 0.193645 0.190831 0.199913 0.182051 0.199914 0.182077 0.166205 0.166202 0.232571 0.232577 0.210051 0.179806 0.199065 0.206143 0.210048 0.179812 0.199047 0.206144 0.197092 0.191133 0.189204 0.196687 0.197094 0.191130 0.189209 0.196688 0.195110 0.190519 0.195112 0.190517
chargesum: 0.00000
title: Mulliken charges with hydrogens summed into heavy atoms:
elementType: N N C C C C C C C C C C C C C C C C C C C C
charge: -0.100751 -0.100749 0.176327 0.176332 -0.033030 -0.076542 -0.033031 -0.076567 -0.056311 -0.056334 0.191428 0.191448 -0.070338 -0.014042 -0.070368 -0.014041 -0.006729 -0.010591 -0.006720 -0.010582 0.000593 0.000597
polarizability: 2.84610727e+02 3.39198938e-03 1.97413570e+02 2.07148759e+00 1.13185544e-02 1.96279766e+02
1716.lowfreq: -1.2647 -0.0012 -0.0011 0.0014 6.2624 13.5569 23.8381 28.2864 36.5196
frequency: 23.7989 25.1540 36.5152 43.3722 51.3328 53.5914 97.2057 102.9925 124.0807 132.1027 164.2799 171.0137 215.8819 226.9301 230.0287 233.0162 233.5293 249.9063 288.9022 330.2721 330.9482 358.9634 363.3045 390.4506 413.7144 433.5567 433.8062 444.2554 446.0261 453.4080 472.6699 480.9882 496.5550 561.2370 574.1333 603.6006 680.1741 683.5025 767.0446 782.0551 784.1192 785.4812 791.5790 792.4748 835.7371 844.8209 845.9298 879.7536 881.3609 882.1824 892.9100 892.9379 907.6918 919.6837 919.8663 942.9084 952.3717 965.9798 977.0343 983.7174 1022.1024 1039.7621 1043.3724 1050.6821 1050.7721 1054.0350 1056.8554 1057.3560 1071.0873 1079.0851 1079.1094 1107.6383 1107.7853 1112.6285 1112.8722 1134.9745 1141.7466 1144.4683 1147.8074 1150.3462 1159.6299 1172.6226 1195.9532 1202.0304 1214.8089 1226.3451 1241.5834 1241.9336 1244.6012 1251.5207 1253.1201 1258.3246 1258.3991 1263.0381 1276.8182 1287.6717 1303.1434 1303.9340 1306.6907 1307.4366 1310.9229 1310.9734 1328.4244 1328.6110 1334.9929 1335.0634 1339.5977 1340.5611 1341.6255 1341.7363 1344.7170 1345.0768 1351.5997 1356.3836 1360.7772 1365.8451 1373.8288 1373.9186 1459.6184 1459.7880 1460.5799 1461.9575 1464.5014 1464.5443 1466.1470 1466.2317 1469.2775 1469.3451 1470.3730 1473.0508 1473.1181 1473.7137 1480.4194 1480.7773 1484.2414 1484.8413 2807.4308 2807.5956 2829.7472 2830.4339 2911.9663 2914.6664 2949.0016 2950.3064 2955.5643 2958.6324 2958.6412 2960.1362 2964.4859 2964.5133 2966.8130 2966.8315 2969.1380 2969.1592 2977.5198 2977.5660 3001.8302 3001.9043 3010.3368 3017.1779 3017.2667 3020.3900 3026.7495 3026.8209 3028.2963 3028.3152 3036.1558 3036.1762 3044.5962 3044.6384 3047.1525 3047.2603 3400.4505 3400.4522
redmass: 4.1959 3.4122 2.7686 2.7213 3.6881 3.8680 3.1233 3.6312 2.8026 3.5436 2.8982 2.2348 2.4992 2.3180 1.7950 1.9946 2.4529 2.1808 3.4405 1.8468 1.8377 2.2112 2.5957 3.7065 1.9762 2.8567 2.2347 2.7959 2.8498 2.7742 1.9028 1.8849 2.4332 2.3889 2.2671 1.8782 1.4360 1.4655 2.7089 2.1311 1.5296 1.9937 1.5039 1.6283 2.1767 2.1050 1.9952 1.7305 1.7252 1.6593 1.5674 1.5687 1.3608 1.8212 1.8296 2.1221 1.7927 2.1560 1.8110 2.0214 2.7240 2.3434 2.1876 1.5505 1.5338 1.0960 1.2864 1.2005 1.8667 1.5264 1.5891 2.1154 2.6092 2.3146 2.5692 1.6842 2.3536 3.0020 3.0850 2.7136 2.1314 1.3498 1.6952 1.3113 1.5119 1.3116 1.3343 1.3347 1.2337 1.2742 1.2515 1.2638 1.2611 1.2786 1.2547 1.1693 1.2906 1.2323 1.2491 1.2655 1.3389 1.3365 1.3566 1.3928 1.3778 1.3759 1.5629 1.5333 1.4616 1.4611 1.5118 1.5047 1.6457 1.4422 1.5178 1.5689 1.5417 1.5549 1.1866 1.1921 1.0907 1.0952 1.0896 1.0897 1.0958 1.0962 1.1279 1.1312 1.0856 1.0835 1.0835 1.0939 1.0930 1.0950 1.0882 1.0896 1.0799 1.0800 1.0713 1.0711 1.0810 1.0813 1.0678 1.0587 1.0664 1.0596 1.0596 1.0644 1.0619 1.0619 1.0615 1.0615 1.0655 1.0655 1.0618 1.0618 1.0875 1.0872 1.0963 1.0990 1.0987 1.1013 1.0950 1.0949 1.1000 1.0999 1.1025 1.1025 1.1030 1.1028 1.0923 1.0978 1.0734 1.0734
irintensity: 0.0632 0.3373 0.0546 0.1743 0.0795 0.0017 0.0686 0.4200 2.2197 0.1408 0.0112 2.2569 0.8566 0.0446 0.0181 0.0411 0.9386 0.7822 0.1327 3.7221 0.0189 5.2535 1.7573 0.4427 8.5200 0.0461 0.1003 0.6108 0.0509 7.4854 0.0004 0.1808 2.2696 6.0046 3.5701 21.1157 86.5928 49.0986 0.1332 0.6399 0.0605 1.3252 0.0603 0.2911 2.1926 1.5652 11.5113 0.1982 3.5807 14.0230 9.5369 11.8756 2.5019 1.7565 0.9175 11.2058 1.8526 3.9846 0.2471 0.0240 0.0116 2.8894 0.0523 1.5710 0.2679 1.9510 0.0099 0.0512 0.0130 3.2228 10.9694 20.3474 0.1550 0.0574 7.3885 3.8041 25.0322 9.0797 54.3218 12.3363 1.0328 31.2593 2.7887 0.5665 8.5260 1.2837 3.9270 1.2009 0.6491 7.0489 0.1682 4.6275 0.0327 16.6757 0.0000 0.6013 1.5373 7.5378 0.0543 0.0158 1.8744 0.1390 0.0693 0.4710 1.6985 0.3555 9.3277 2.3361 0.7346 0.9916 17.5209 4.9046 0.5944 22.9813 3.1834 2.9733 6.9001 25.0903 0.6660 16.6760 1.1244 9.1688 1.4474 0.9261 6.3103 6.0584 27.8958 7.6047 18.3565 20.5879 19.7662 1.9584 8.2557 4.3802 8.9588 0.7674 110.2073 46.7971 12.0182 237.6324 31.6080 0.3767 29.9193 26.1571 12.9138 63.2228 7.4775 98.7640 44.6838 27.8305 36.0091 41.7129 93.1012 0.3412 31.1528 11.9601 27.6805 5.3335 62.8045 91.2269 6.9398 125.6830 121.7634 20.4192 9.4853 82.3027 11.2574 11.2050 29.7153 200.1380 60.4276 52.5337 0.9521 8.0052
temp: 298.150 k
press: 1.00000 atm
elementType: 7 7 6 6 6 6 6 6 6 6 6 6 6 6 6 6 6 6 6 6 6 6 1 1 1 1 1 1 1 1 1 1 1 1 1 1 1 1 1 1 1 1 1 1 1 1 1 1 1 1 1 1 1 1 1 1 1 1 1 1
symmnumber: 1
zpe: 1448021.1 jmol-1
zpe.correction: 0.551522 hartree
zpe.thermalcorrener: 0.574405 hartree
zpe.thermalcorrenthalpy: 0.575349 hartree
zpe.thermalcorrgfe: 0.497854 hartree
zpe.sumelectzpe: -892.628547 hartree
zpe.sumelectthermal: -892.605664 hartree
zpe.sumelectthermalent: -892.604720 hartree
zpe.sumelectthermalfe: -892.682215 hartree
dipole: -0.0005 1.2591 -0.0015
dipole: 1.2591
quadrupole: -132.2445 -140.1140 -135.3997
quadrupole: -0.0045 -3.8599 0.0056
quadrupole: 3.6749 -4.1946 0.5197 -0.0045 -3.8599 0.0056
hfenergy: -893.1800689 hartree
pointgroup: C01 [X(C20H38N2)]
dipole: -0.0002014 -0.4953622 -0.0006745 debye
polarizability: 284.5843651|0.0029303|197.4135047|-2.5727233|0.014178|196.3061929 unknown
InChI: InChI=1S/C20H38N2/c1-3-7-19(8-4-1)21-15-17-11-13-18(14-12-17)16-22-20-9-5-2-6-10-20/h17-22H,1-16H2
charge 0 multiplicity 1
60 atoms
N  3.714914 -0.08214 0.563078
N  -3.715192 -0.080579 -0.563846
C  1.475894 -1.166197 0.306903
C  -1.475958 -1.165187 -0.311546
C  0.746079 0.102121 -0.200683
C  0.749605 -2.43904 -0.196129
C  -0.746104 0.101475 0.20014
C  -0.749571 -2.439704 0.187075
C  2.968755 -1.181086 -0.091097
C  -2.968725 -1.181437 0.086755
C  5.169241 -0.013253 0.276003
C  -5.169358 -0.012544 -0.27574
C  5.839541 0.947245 1.286573
C  5.436747 0.469173 -1.171847
C  -5.840399 0.950263 -1.283616
C  -5.436048 0.466444 1.173398
C  7.354842 1.102424 1.019719
C  6.951617 0.616987 -1.451429
C  -7.35556 1.104583 -1.015449
C  -6.950761 0.613468 1.454289
C  7.623089 1.567305 -0.431729
C  -7.622968 1.566106 0.437228
H  1.418589 -1.166997 1.421051
H  -1.418895 -1.162238 -1.425699
H  0.830778 0.137489 -1.308607
H  1.261884 1.001275 0.18277
H  1.243778 -3.344769 0.209917
H  0.844287 -2.491907 -1.302031
H  -0.830814 0.133227 1.308174
H  -1.261913 1.001872 -0.180385
H  -1.243737 -3.344041 -0.222075
H  -0.844193 -2.496414 1.292794
H  3.044862 -1.056751 -1.189229
H  3.402214 -2.18818 0.147597
H  -3.044571 -1.060464 1.185276
H  -3.40214 -2.187841 -0.154902
H  5.654384 -1.021338 0.389857
H  -5.654455 -1.020405 -0.391727
H  3.550765 -0.098508 1.581606
H  -3.551614 -0.094051 -1.582511
H  5.338971 1.93387 1.208092
H  5.671045 0.578647 2.32031
H  4.987579 -0.232963 -1.900409
H  4.92603 1.444234 -1.303711
H  -5.339918 1.936771 -1.203111
H  -5.672489 0.584136 -2.318328
H  -4.986333 -0.237337 1.900038
H  -4.925372 1.44126 1.307211
H  7.792598 1.820101 1.740445
H  7.860447 0.129097 1.189543
H  7.437269 -0.379856 -1.393959
H  7.108775 0.987843 -2.482882
H  -7.793904 1.823814 -1.734264
H  -7.861099 0.13155 -1.187136
H  -7.43638 -0.383272 1.394815
H  -7.107273 0.981903 2.486707
H  8.7130 1.625223 -0.619788
H  7.216806 2.591193 -0.5670
H  -8.712764 1.623492 0.626103
H  -7.216674 2.589709 0.574599
