program: Orca
programVersion: 5.0.2
elementType: N C C C C C C C C C C C C C C C C C C C C C H H H H H H H H H H H H H H H H H H H H H H H H H H
charge: 1
multiplicity: 1
keywords: wb97x-d3
keywords: def2-TZVPP
keywords: def2/J RIJCOSX
keywords: DEFGRID2
keywords: scfconv7
keywords: smallprint printgap noloewdin
keywords: NOSOSCF
formula: C21H26N
InChI: InChI=1/C21H26N/c1-21(2,3)15-8-5-9-16-22(4)17-19-13-10-12-18-11-6-7-14-20(18)19/h5-7,9-14,22H,16-17H2,1-4H3
48 atoms
N  2.780353 -1.728083 0.130941
C  2.309882 -0.900982 1.293352
C  2.445829 0.574095 1.039799
C  1.319908 1.444958 0.95817
C  1.547736 2.820053 0.665906
C  -4.381514 -1.688301 -1.032552
C  2.031841 -1.484147 -1.15055
C  3.712217 1.085718 0.89106
C  -0.018018 1.0267 1.168572
C  2.826658 -3.165462 0.500033
C  2.867254 3.292794 0.490371
C  3.931248 2.444992 0.610308
C  0.448476 3.704592 0.560495
C  -4.987352 -0.615161 -0.119971
C  -4.599434 -3.076403 -0.420237
C  -5.034148 -1.622861 -2.418124
C  0.590291 -1.837961 -1.05991
C  -1.059807 1.906901 1.063226
C  -0.829508 3.260212 0.7483
C  -2.944034 -1.437776 -1.161368
C  -0.369649 -0.944678 -1.313812
C  -1.757277 -1.233674 -1.246083
H  2.932448 -1.201865 2.135577
H  1.294847 -1.219804 1.511228
H  2.17257 -0.436173 -1.411161
H  2.543628 -2.088239 -1.901655
H  4.572282 0.432139 0.992854
H  -0.238829 -0.000374 1.421768
H  3.165547 -3.740573 -0.35748
H  1.840476 -3.499669 0.808187
H  3.5241 -3.291031 1.323764
H  3.022647 4.342196 0.269882
H  4.942853 2.810719 0.494391
H  0.640538 4.745519 0.328956
H  -4.537836 -0.638001 0.873879
H  -6.059888 -0.785172 -0.00774
H  -4.846629 0.38484 -0.532524
H  -4.173485 -3.860087 -1.048318
H  -4.146759 -3.151816 0.569316
H  -5.668042 -3.273502 -0.315968
H  -4.899329 -0.642918 -2.877827
H  -4.61763 -2.372853 -3.091757
H  -6.106156 -1.808973 -2.331282
H  0.327116 -2.862997 -0.823374
H  -2.071894 1.558509 1.22552
H  -1.664131 3.944177 0.665397
H  -0.100046 0.075008 -1.573223
H  3.745999 -1.452755 -0.066841
elementType: N C H
totalener: -870.50414908 hartree
nucrepener: 1714.53975604 hartree
electener: -2585.04390513 hartree
oneelecener: -4560.79986311 hartree
twoeener: 1975.75595798 hartree
cpcmener: -0.09912674 hartree
kineticenergy: 866.20253085 hartree
xcener: -89.068588743606 hartree
chargesum: 1.0000000
charge: 0.209408 -0.108857 0.030336 -0.017274 -0.044185 0.078257 -0.110520 -0.151212 -0.276567 -0.193390 -0.116365 -0.147860 -0.075250 -0.301635 -0.290191 -0.288059 -0.115994 -0.090574 -0.168881 -0.231123 -0.254933 0.215910 0.160588 0.147919 0.145017 0.155909 0.139075 0.145123 0.141428 0.132653 0.139519 0.145040 0.159915 0.142489 0.100695 0.101918 0.102938 0.101412 0.100308 0.098288 0.101757 0.102220 0.098954 0.142749 0.161282 0.158884 0.145120 0.177761
qa: 0.2094 -0.1089 0.0303 -0.0173 -0.0442 0.0783 -0.1105 -0.1512 -0.2766 -0.1934 -0.1164 -0.1479 -0.0753 -0.3016 -0.2902 -0.2881 -0.1160 -0.0906 -0.1689 -0.2311 -0.2549 0.2159 0.1606 0.1479 0.1450 0.1559 0.1391 0.1451 0.1414 0.1327 0.1395 0.1450 0.1599 0.1425 0.1007 0.1019 0.1029 0.1014 0.1003 0.0983 0.1018 0.1022 0.0990 0.1427 0.1613 0.1589 0.1451 0.1778
va: 3.6400 3.8180 3.5229 3.7085 3.9190 4.0134 3.9135 3.9347 3.9191 3.8683 3.9262 3.9090 3.8669 3.8997 3.8954 3.8962 3.8125 3.8601 3.9503 4.0479 4.0051 3.6676 0.9913 0.9966 0.9958 0.9903 1.0035 1.0081 0.9935 0.9943 0.9956 1.0040 0.9906 1.0048 1.0045 1.0047 1.0046 1.0055 1.0052 1.0038 1.0054 1.0054 1.0028 1.0065 0.9906 0.9905 0.9896 0.9923
dispersion: -0.023385558 hartree
energy: -870.527534642360 hartree
dipole: -13.58389 18.01428 4.43039 -16.95326 14.02025 -2.93301 -3.39526 3.69535 0.30009
magnitude: 5.32174 au
magnitude: 13.52680 debye
