program: Orca
programVersion: 5.0.2
elementType: N C C C C C C C C C C C C C C C C C C C C C H H H H H H H H H H H H H H H H H H H H H H H H H H
charge: 1
multiplicity: 1
keywords: wb97x-d3
keywords: def2-TZVPP
keywords: def2/J RIJCOSX
keywords: DEFGRID2
keywords: scfconv7
keywords: smallprint printgap noloewdin
keywords: NOSOSCF
formula: C21H26N
InChI: InChI=1/C21H26N/c1-21(2,3)15-8-5-9-16-22(4)17-19-13-10-12-18-11-6-7-14-20(18)19/h5-7,9-14,22H,16-17H2,1-4H3
48 atoms
N  2.786182 -1.733375 0.063335
C  2.318998 -0.956502 1.261478
C  2.443909 0.527899 1.063879
C  1.312201 1.394548 1.025847
C  1.529328 2.780578 0.781361
C  -4.36943 -1.628982 -1.112441
C  2.03915 -1.432049 -1.206734
C  3.705785 1.052289 0.920506
C  -0.02156 0.96101 1.232473
C  2.830926 -3.185887 0.367943
C  2.844194 3.267226 0.608976
C  3.914049 2.421936 0.686531
C  0.424278 3.661979 0.718977
C  -4.676202 -2.030275 0.335325
C  -4.749822 -2.771649 -2.061095
C  -5.150849 -0.362382 -1.477124
C  0.595522 -1.780654 -1.133061
C  -1.068927 1.838512 1.169843
C  -0.849271 3.203729 0.902914
C  -2.93376 -1.363941 -1.230275
C  -0.358003 -0.870641 -1.348663
C  -1.74704 -1.155281 -1.301877
H  2.949789 -1.286144 2.087058
H  1.307194 -1.28953 1.474034
H  2.185021 -0.374692 -1.423057
H  2.547971 -2.006214 -1.983027
H  4.570809 0.400937 0.987575
H  -0.234819 -0.075938 1.449085
H  3.525601 -3.348997 1.187179
H  3.17219 -3.722095 -0.513483
H  1.844007 -3.534275 0.657839
H  2.991172 4.324684 0.425048
H  4.922153 2.797514 0.57234
H  0.608436 4.711749 0.524588
H  -4.135715 -2.933513 0.621197
H  -5.743906 -2.22734 0.448433
H  -4.404434 -1.23759 1.033842
H  -4.540007 -2.514321 -3.100004
H  -4.205098 -3.685924 -1.822001
H  -5.817104 -2.984385 -1.976652
H  -4.898157 0.466149 -0.814152
H  -4.947672 -0.049367 -2.502072
H  -6.222766 -0.548445 -1.388846
H  0.325066 -2.813017 -0.941756
H  -2.07738 1.478247 1.327442
H  -1.688469 3.885059 0.852478
H  -0.081631 0.156406 -1.56841
H  3.752144 -1.451592 -0.122258
elementType: N C H
totalener: -870.50420285 hartree
nucrepener: 1715.83198051 hartree
electener: -2586.33618335 hartree
oneelecener: -4563.39281272 hartree
twoeener: 1977.05662937 hartree
cpcmener: -0.09927061 hartree
kineticenergy: 866.20721530 hartree
xcener: -89.069559973097 hartree
chargesum: 1.0000000
charge: 0.208628 -0.108743 0.030571 -0.024389 -0.040412 0.058943 -0.110239 -0.149677 -0.268652 -0.193414 -0.117201 -0.147816 -0.076453 -0.287206 -0.285428 -0.286763 -0.118966 -0.095996 -0.166084 -0.240670 -0.249413 0.229485 0.160998 0.147791 0.144453 0.155813 0.138873 0.145715 0.139577 0.141547 0.132718 0.144766 0.159906 0.142669 0.100744 0.099039 0.100183 0.102097 0.100256 0.098630 0.099342 0.101899 0.098364 0.143188 0.159332 0.159031 0.145238 0.177726
qa: 0.2086 -0.1087 0.0306 -0.0244 -0.0404 0.0589 -0.1102 -0.1497 -0.2687 -0.1934 -0.1172 -0.1478 -0.0765 -0.2872 -0.2854 -0.2868 -0.1190 -0.0960 -0.1661 -0.2407 -0.2494 0.2295 0.1610 0.1478 0.1445 0.1558 0.1389 0.1457 0.1396 0.1415 0.1327 0.1448 0.1599 0.1427 0.1007 0.0990 0.1002 0.1021 0.1003 0.0986 0.0993 0.1019 0.0984 0.1432 0.1593 0.1590 0.1452 0.1777
va: 3.6405 3.8170 3.5228 3.7070 3.9164 4.0362 3.9152 3.9326 3.9117 3.8680 3.9259 3.9082 3.8673 3.8938 3.8915 3.8932 3.8146 3.8640 3.9465 4.0534 4.0030 3.6461 0.9913 0.9965 0.9960 0.9903 1.0036 1.0078 0.9956 0.9935 0.9945 1.0041 0.9906 1.0048 1.0057 1.0034 1.0065 1.0057 1.0059 1.0032 1.0063 1.0059 1.0034 1.0067 0.9927 0.9902 0.9894 0.9923
dispersion: -0.023371387 hartree
energy: -870.527574234032 hartree
dipole: -13.47957 17.92401 4.44445 -16.81890 13.85779 -2.96111 -4.12871 4.31275 0.18404
magnitude: 5.34370 au
magnitude: 13.58261 debye
