program: Orca
programVersion: 5.0.2
elementType: N C C C C C C C C C C C C C C C C C C C C C H H H H H H H H H H H H H H H H H H H H H H H H H H
charge: 1
multiplicity: 1
keywords: wb97x-d3
keywords: def2-TZVPP
keywords: def2/J RIJCOSX
keywords: DEFGRID2
keywords: scfconv7
keywords: smallprint printgap noloewdin
keywords: NOSOSCF
formula: C21H26N
InChI: InChI=1/C21H26N/c1-21(2,3)15-8-5-9-16-22(4)17-19-13-10-12-18-11-6-7-14-20(18)19/h5-7,9-14,22H,16-17H2,1-4H3
48 atoms
N  2.763391 -1.725798 0.06536
C  2.312512 -0.939687 1.263639
C  2.45905 0.542358 1.063102
C  1.340289 1.425582 1.021253
C  1.578313 2.808216 0.776871
C  -4.399377 -1.681332 -1.113569
C  2.00825 -1.423497 -1.199518
C  3.728812 1.048157 0.922584
C  -0.000082 1.011833 1.225274
C  2.79732 -3.177351 0.376125
C  2.90071 3.275464 0.608332
C  3.957772 2.41456 0.689023
C  0.486576 3.705786 0.712032
C  -4.794229 -1.710698 0.368071
C  -4.689176 -3.042447 -1.755926
C  -5.183087 -0.582489 -1.839121
C  0.567569 -1.782898 -1.121637
C  -1.034215 1.904807 1.160625
C  -0.79391 3.266499 0.893928
C  -2.965351 -1.400025 -1.213624
C  -0.394765 -0.880352 -1.328807
C  -1.780571 -1.179826 -1.280004
H  2.94211 -1.276538 2.08717
H  1.296857 -1.257606 1.481128
H  2.146611 -0.364518 -1.412943
H  2.516292 -1.992064 -1.980423
H  4.583819 0.384019 0.992278
H  -0.228814 -0.021913 1.441391
H  3.118719 -3.721583 -0.507783
H  1.811426 -3.513394 0.683174
H  3.502696 -3.344437 1.18521
H  3.063706 4.330693 0.425202
H  4.97159 2.775473 0.578357
H  0.686554 4.752662 0.517818
H  -4.250371 -2.485413 0.910057
H  -5.861433 -1.919093 0.463618
H  -4.593859 -0.753943 0.852565
H  -4.412924 -3.052022 -2.81103
H  -4.143458 -3.843448 -1.255727
H  -5.755024 -3.267105 -1.685281
H  -4.994302 0.397943 -1.399984
H  -4.919134 -0.536578 -2.896469
H  -6.253944 -0.781979 -1.768831
H  0.306294 -2.818751 -0.936861
H  -2.048126 1.559652 1.316844
H  -1.622849 3.96017 0.842112
H  -0.128739 0.151121 -1.539998
H  3.7302 -1.45317 -0.129166
elementType: N C H
totalener: -870.50430958 hartree
nucrepener: 1711.79531118 hartree
electener: -2582.29962076 hartree
oneelecener: -4555.31257230 hartree
twoeener: 1973.01295154 hartree
cpcmener: -0.09913859 hartree
kineticenergy: 866.20905670 hartree
xcener: -89.069719302540 hartree
chargesum: 1.0000000
charge: 0.209752 -0.107613 0.029218 -0.015638 -0.041783 0.061017 -0.110137 -0.151203 -0.279054 -0.194524 -0.117453 -0.147473 -0.074800 -0.289161 -0.286762 -0.286404 -0.117331 -0.091966 -0.168698 -0.235422 -0.256626 0.230241 0.161022 0.147775 0.144795 0.155891 0.139059 0.144840 0.141895 0.132527 0.139767 0.144838 0.159971 0.142704 0.101210 0.099245 0.100785 0.101885 0.099656 0.098519 0.100235 0.101489 0.098376 0.142573 0.160581 0.159131 0.145507 0.177545
qa: 0.2098 -0.1076 0.0292 -0.0156 -0.0418 0.0610 -0.1101 -0.1512 -0.2791 -0.1945 -0.1175 -0.1475 -0.0748 -0.2892 -0.2868 -0.2864 -0.1173 -0.0920 -0.1687 -0.2354 -0.2566 0.2302 0.1610 0.1478 0.1448 0.1559 0.1391 0.1448 0.1419 0.1325 0.1398 0.1448 0.1600 0.1427 0.1012 0.0992 0.1008 0.1019 0.0997 0.0985 0.1002 0.1015 0.0984 0.1426 0.1606 0.1591 0.1455 0.1775
va: 3.6398 3.8164 3.5220 3.7041 3.9184 4.0337 3.9136 3.9354 3.9206 3.8687 3.9264 3.9087 3.8652 3.8950 3.8926 3.8929 3.8158 3.8624 3.9483 4.0520 4.0050 3.6532 0.9912 0.9966 0.9958 0.9901 1.0034 1.0080 0.9932 0.9941 0.9957 1.0042 0.9905 1.0048 1.0052 1.0037 1.0065 1.0057 1.0061 1.0032 1.0060 1.0059 1.0032 1.0065 0.9922 0.9904 0.9890 0.9925
dispersion: -0.023207916 hartree
energy: -870.527517497008 hartree
dipole: -13.72754 18.13439 4.40685 -17.05472 14.10557 -2.94915 -4.18914 4.36819 0.17906
magnitude: 5.30564 au
magnitude: 13.48588 debye
