program: Orca
programVersion: 5.0.2
elementType: N C C C C C C C C C C C C C C C C C C C C C H H H H H H H H H H H H H H H H H H H H H H H H H H
charge: 1
multiplicity: 1
keywords: wb97x-d3
keywords: def2-TZVPP
keywords: def2/J RIJCOSX
keywords: DEFGRID2
keywords: scfconv7
keywords: smallprint printgap noloewdin
keywords: NOSOSCF
formula: C21H26N
InChI: InChI=1/C21H26N/c1-21(2,3)15-8-5-9-16-22(4)17-19-13-10-12-18-11-6-7-14-20(18)19/h5-7,9-14,22H,16-17H2,1-4H3
48 atoms
N  1.896782 -1.159445 -0.660885
C  3.00743 -0.14509 -0.636636
C  2.482973 1.261506 -0.598591
C  2.490946 2.053289 0.587795
C  1.940412 3.364438 0.529951
C  -4.97692 -3.017823 -0.701536
C  1.036819 -1.112774 0.571339
C  1.967425 1.782111 -1.760592
C  3.012982 1.606391 1.827288
C  2.435101 -2.517702 -0.916849
C  1.405261 3.849098 -0.684654
C  1.419127 3.075253 -1.809953
C  1.93131 4.170103 1.692723
C  -6.075179 -2.133319 -0.100414
C  -5.034337 -4.419959 -0.08687
C  -5.15677 -3.107978 -2.221601
C  -0.224306 -1.885177 0.38117
C  2.9922 2.410842 2.93384
C  2.445569 3.707134 2.87057
C  -3.672695 -2.41663 -0.414185
C  -1.361173 -1.265473 0.049119
C  -2.597172 -1.919335 -0.184935
H  3.577188 -0.309872 -1.550213
H  3.650916 -0.404754 0.200575
H  1.643646 -1.498838 1.390485
H  0.81062 -0.066581 0.765741
H  1.981183 1.184749 -2.665796
H  3.440113 0.616837 1.917029
H  1.615336 -3.225044 -1.001468
H  3.086892 -2.800177 -0.094031
H  2.994678 -2.505729 -1.848065
H  0.987278 4.848236 -0.709816
H  1.015755 3.450427 -2.741041
H  1.507322 5.165256 1.632192
H  -6.051541 -1.127938 -0.522743
H  -5.970465 -2.048426 0.981985
H  -7.056101 -2.563632 -0.310592
H  -6.004363 -4.876278 -0.292724
H  -4.263311 -5.069254 -0.503614
H  -4.901386 -4.387268 0.995152
H  -6.127569 -3.549855 -2.453813
H  -5.116126 -2.122518 -2.68751
H  -4.386536 -3.730845 -2.678371
H  -0.200738 -2.960666 0.510801
H  3.400471 2.046909 3.867775
H  2.435495 4.331211 3.754516
H  -1.364175 -0.183342 -0.058712
H  1.290529 -0.922752 -1.452156
elementType: N C H
totalener: -870.50588703 hartree
nucrepener: 1637.28547344 hartree
electener: -2507.79136047 hartree
oneelecener: -4406.05618424 hartree
twoeener: 1898.26482377 hartree
cpcmener: -0.09745793 hartree
kineticenergy: 866.20350677 hartree
xcener: -89.064260214629 hartree
chargesum: 1.0000000
charge: 0.199396 -0.090869 0.066587 -0.095774 -0.017232 0.058979 -0.088931 -0.182333 -0.208324 -0.183101 -0.128973 -0.135004 -0.086394 -0.288331 -0.288361 -0.287027 -0.187920 -0.137353 -0.145801 -0.248958 -0.188374 0.225666 0.153986 0.152294 0.153563 0.142023 0.146322 0.143570 0.134563 0.139752 0.136294 0.145042 0.159652 0.143378 0.101061 0.101708 0.098499 0.098405 0.100478 0.101915 0.098946 0.101540 0.101332 0.151500 0.157206 0.160269 0.140270 0.174865
qa: 0.1994 -0.0909 0.0666 -0.0958 -0.0172 0.0590 -0.0889 -0.1823 -0.2083 -0.1831 -0.1290 -0.1350 -0.0864 -0.2883 -0.2884 -0.2870 -0.1879 -0.1374 -0.1458 -0.2490 -0.1884 0.2257 0.1540 0.1523 0.1536 0.1420 0.1463 0.1436 0.1346 0.1398 0.1363 0.1450 0.1597 0.1434 0.1011 0.1017 0.0985 0.0984 0.1005 0.1019 0.0989 0.1015 0.1013 0.1515 0.1572 0.1603 0.1403 0.1749
va: 3.6660 3.7928 3.4892 3.7813 3.8756 4.0338 3.8902 3.9658 3.9202 3.8633 3.9387 3.9021 3.8768 3.8960 3.8945 3.8965 3.9001 3.9275 3.9138 4.0833 4.0030 3.6913 0.9957 0.9990 1.0001 1.0012 1.0011 1.0059 0.9959 0.9944 0.9960 1.0042 0.9902 1.0052 1.0056 1.0056 1.0032 1.0035 1.0057 1.0053 1.0032 1.0054 1.0054 1.0016 0.9923 0.9894 1.0001 0.9966
dispersion: -0.020644168 hartree
energy: -870.526531200620 hartree
dipole: -17.05163 20.03423 2.98260 -21.39355 19.44923 -1.94431 -5.30496 4.15513 -1.14984
magnitude: 3.74144 au
magnitude: 9.50999 debye
