program: Orca
programVersion: 5.0.2
elementType: N C C C C C C C C C C C C C C C C C C C C C H H H H H H H H H H H H H H H H H H H H H H H H H H
charge: 1
multiplicity: 1
keywords: wb97x-d3
keywords: def2-TZVPP
keywords: def2/J RIJCOSX
keywords: DEFGRID2
keywords: scfconv7
keywords: smallprint printgap noloewdin
keywords: NOSOSCF
formula: C21H26N
InChI: InChI=1/C21H26N/c1-21(2,3)15-8-5-9-16-22(4)17-19-13-10-12-18-11-6-7-14-20(18)19/h5-7,9-14,22H,16-17H2,1-4H3
48 atoms
N  0.861059 -0.406929 -0.249222
C  2.228276 -0.19801 0.338877
C  2.363897 1.147711 0.987852
C  3.048689 2.23483 0.37104
C  3.126894 3.470736 1.070379
C  -5.548008 -3.473102 -0.668757
C  0.67289 -1.849353 -0.637964
C  1.805145 1.312729 2.231569
C  3.661587 2.152042 -0.90302
C  0.573599 0.517733 -1.372429
C  2.524776 3.596246 2.342267
C  1.875677 2.539226 2.913324
C  3.808246 4.562321 0.483382
C  -5.799005 -3.938364 -2.106585
C  -6.320589 -2.176087 -0.399726
C  -5.992872 -4.55812 0.317596
C  -0.745694 -2.146985 -0.986281
C  4.315873 3.22486 -1.443058
C  4.393235 4.444971 -0.745138
C  -4.116851 -3.215327 -0.486594
C  -1.5768 -2.687956 -0.090252
C  -2.942518 -2.980152 -0.335773
H  2.943635 -0.380502 -0.459586
H  2.358987 -0.981813 1.08332
H  1.351774 -2.038823 -1.469531
H  0.995469 -2.443252 0.216368
H  1.303966 0.476663 2.706639
H  3.623775 1.230805 -1.467035
H  1.274151 0.321574 -2.179377
H  0.670573 1.543775 -1.031571
H  -0.443846 0.35903 -1.716635
H  2.59133 4.544292 2.861269
H  1.421377 2.634543 3.890204
H  3.860387 5.495904 1.029692
H  -5.483244 -3.18594 -2.830033
H  -6.86444 -4.121969 -2.254964
H  -5.265341 -4.863901 -2.325123
H  -6.16525 -1.824829 0.620884
H  -6.01581 -1.382042 -1.082234
H  -7.389617 -2.34669 -0.53753
H  -5.453841 -5.491698 0.152495
H  -5.828216 -4.249822 1.35059
H  -7.058228 -4.75899 0.192473
H  -1.091543 -1.914199 -1.986123
H  4.779422 3.135438 -2.416467
H  4.914834 5.284806 -1.184518
H  -1.204121 -2.935062 0.900595
H  0.178669 -0.210046 0.489658
elementType: N C H
totalener: -870.50628458 hartree
nucrepener: 1598.16778718 hartree
electener: -2468.67407176 hartree
oneelecener: -4327.72621663 hartree
twoeener: 1859.05214487 hartree
cpcmener: -0.09816268 hartree
kineticenergy: 866.22527835 hartree
xcener: -89.068287216579 hartree
chargesum: 1.0000000
charge: 0.211748 -0.091605 0.057943 -0.097271 -0.020932 0.059320 -0.070932 -0.160837 -0.207566 -0.208358 -0.119725 -0.149488 -0.088857 -0.285747 -0.287322 -0.287833 -0.178910 -0.145546 -0.144810 -0.256558 -0.193530 0.226651 0.153368 0.150398 0.148942 0.131554 0.144184 0.143542 0.142297 0.144424 0.143426 0.145062 0.159805 0.142934 0.099973 0.098450 0.101748 0.101887 0.101185 0.098801 0.101471 0.100941 0.098330 0.153822 0.157840 0.159388 0.141561 0.174834
qa: 0.2117 -0.0916 0.0579 -0.0973 -0.0209 0.0593 -0.0709 -0.1608 -0.2076 -0.2084 -0.1197 -0.1495 -0.0889 -0.2857 -0.2873 -0.2878 -0.1789 -0.1455 -0.1448 -0.2566 -0.1935 0.2267 0.1534 0.1504 0.1489 0.1316 0.1442 0.1435 0.1423 0.1444 0.1434 0.1451 0.1598 0.1429 0.1000 0.0985 0.1017 0.1019 0.1012 0.0988 0.1015 0.1009 0.0983 0.1538 0.1578 0.1594 0.1416 0.1748
va: 3.6528 3.8012 3.5047 3.8055 3.8776 4.0351 3.8836 3.9508 3.9288 3.8698 3.9321 3.9127 3.8768 3.8935 3.8960 3.8944 3.8971 3.9372 3.9111 4.0807 4.0079 3.6780 0.9978 0.9974 0.9983 1.0045 1.0022 1.0056 0.9928 0.9896 0.9981 1.0040 0.9907 1.0054 1.0060 1.0034 1.0057 1.0056 1.0054 1.0034 1.0056 1.0056 1.0033 0.9993 0.9923 0.9897 1.0003 0.9963
dispersion: -0.020111357 hartree
energy: -870.526395939948 hartree
dipole: -24.56267 25.81135 1.24868 -16.97194 16.36685 -0.60509 -6.95260 6.51569 -0.43691
magnitude: 1.45473 au
magnitude: 3.69763 debye
