program: Orca
programVersion: 5.0.2
elementType: N C C C C C C C C C C C C C C C C C C C C C H H H H H H H H H H H H H H H H H H H H H H H H H H
charge: 1
multiplicity: 1
keywords: wb97x-d3
keywords: def2-TZVPP
keywords: def2/J RIJCOSX
keywords: DEFGRID2
keywords: scfconv7
keywords: smallprint printgap noloewdin
keywords: NOSOSCF
formula: C21H26N
InChI: InChI=1/C21H26N/c1-21(2,3)15-8-5-9-16-22(4)17-19-13-10-12-18-11-6-7-14-20(18)19/h5-7,9-14,22H,16-17H2,1-4H3
48 atoms
N  0.872828 -0.42934 -0.145819
C  2.274277 -0.229289 0.360406
C  2.452029 1.102411 1.029267
C  3.045921 2.219572 0.372024
C  3.157316 3.445367 1.086407
C  -5.535233 -3.424639 -0.760334
C  0.683876 -1.851196 -0.603567
C  2.018617 1.227121 2.326571
C  3.530848 2.179684 -0.958385
C  0.486863 0.548007 -1.190841
C  2.684614 3.528395 2.415546
C  2.126948 2.441597 3.025992
C  3.737322 4.570488 0.455513
C  -5.666568 -4.377294 -1.954502
C  -6.241109 -2.099248 -1.071631
C  -6.15218 -4.063738 0.488203
C  -0.737979 -2.133646 -0.950782
C  4.089032 3.284681 -1.540455
C  4.194015 4.495878 -0.82989
C  -4.11541 -3.162236 -0.518707
C  -1.575235 -2.682347 -0.065098
C  -2.944574 -2.94402 -0.323631
H  2.939704 -0.39239 -0.484382
H  2.45068 -1.030986 1.07587
H  1.349552 -1.993023 -1.454675
H  1.022435 -2.486075 0.214066
H  1.585635 0.36925 2.829135
H  3.468859 1.267358 -1.535733
H  1.110681 0.393347 -2.067625
H  0.614487 1.556568 -0.811028
H  -0.558019 0.403247 -1.448865
H  2.77472 4.469292 2.945141
H  1.770832 2.505496 4.045595
H  3.812806 5.496731 1.012479
H  -5.169808 -5.328854 -1.760469
H  -5.231963 -3.946056 -2.857181
H  -6.720265 -4.582011 -2.152362
H  -5.82326 -1.624752 -1.960481
H  -7.302572 -2.278092 -1.252569
H  -6.155992 -1.397465 -0.240842
H  -5.667723 -5.009893 0.732957
H  -6.0688 -3.406651 1.354905
H  -7.211929 -4.262556 0.318456
H  -1.083602 -1.876767 -1.945087
H  4.454668 3.227751 -2.557545
H  4.63621 5.362228 -1.304252
H  -1.209443 -2.945911 0.92424
H  0.240728 -0.288869 0.648594
elementType: N C H
totalener: -870.50621374 hartree
nucrepener: 1599.91085676 hartree
electener: -2470.41707049 hartree
oneelecener: -4331.20827330 hartree
twoeener: 1860.79120281 hartree
cpcmener: -0.09805613 hartree
kineticenergy: 866.21069459 hartree
xcener: -89.065874177449 hartree
chargesum: 1.0000000
charge: 0.215555 -0.098055 0.064241 -0.110554 -0.016154 0.057124 -0.071139 -0.160149 -0.202977 -0.216860 -0.121795 -0.146128 -0.089372 -0.286549 -0.286572 -0.288240 -0.182063 -0.145778 -0.144606 -0.262646 -0.189156 0.230363 0.154172 0.151144 0.148850 0.134285 0.144024 0.144107 0.143870 0.146438 0.145606 0.145016 0.159917 0.143355 0.102184 0.100481 0.098692 0.100795 0.098695 0.101452 0.101680 0.100789 0.098229 0.153823 0.157951 0.159096 0.142397 0.174462
qa: 0.2156 -0.0981 0.0642 -0.1106 -0.0162 0.0571 -0.0711 -0.1601 -0.2030 -0.2169 -0.1218 -0.1461 -0.0894 -0.2865 -0.2866 -0.2882 -0.1821 -0.1458 -0.1446 -0.2626 -0.1892 0.2304 0.1542 0.1511 0.1489 0.1343 0.1440 0.1441 0.1439 0.1464 0.1456 0.1450 0.1599 0.1434 0.1022 0.1005 0.0987 0.1008 0.0987 0.1015 0.1017 0.1008 0.0982 0.1538 0.1580 0.1591 0.1424 0.1745
va: 3.6525 3.8015 3.5053 3.8147 3.8724 4.0385 3.8787 3.9536 3.9233 3.8715 3.9336 3.9093 3.8779 3.8934 3.8927 3.8941 3.8956 3.9373 3.9125 4.0882 4.0045 3.6718 0.9971 0.9972 0.9988 1.0035 1.0022 1.0040 0.9914 0.9887 0.9969 1.0040 0.9905 1.0051 1.0055 1.0059 1.0033 1.0055 1.0035 1.0056 1.0055 1.0056 1.0034 0.9987 0.9922 0.9897 1.0000 0.9966
dispersion: -0.020198519 hartree
energy: -870.526412254988 hartree
dipole: -24.71332 25.96592 1.25260 -16.78232 16.13522 -0.64710 -7.22760 6.92589 -0.30171
magnitude: 1.44180 au
magnitude: 3.66475 debye
