program: Orca
programVersion: 5.0.2
elementType: N C C C C C C C C C C C C C C C C C C C C C H H H H H H H H H H H H H H H H H H H H H H H H H H
charge: 1
multiplicity: 1
keywords: wb97x-d3
keywords: def2-TZVPP
keywords: def2/J RIJCOSX
keywords: DEFGRID2
keywords: scfconv7
keywords: smallprint printgap noloewdin
keywords: NOSOSCF
formula: C21H26N
InChI: InChI=1/C21H26N/c1-21(2,3)15-8-5-9-16-22(4)17-19-13-10-12-18-11-6-7-14-20(18)19/h5-7,9-14,22H,16-17H2,1-4H3
48 atoms
N  2.341149 -1.181732 -0.426928
C  1.844759 -0.77037 0.933675
C  2.255741 0.619927 1.31005
C  1.576788 1.759611 0.784885
C  2.018076 3.053638 1.175885
C  -4.767364 -1.917029 -1.168664
C  1.635256 -2.418283 -0.91625
C  3.289817 0.792095 2.195212
C  0.474343 1.670215 -0.099922
C  3.812041 -1.363462 -0.452357
C  3.090886 3.181119 2.088421
C  3.709448 2.074397 2.594839
C  1.368451 4.197429 0.65703
C  -5.170117 -0.803938 -0.192452
C  -5.589483 -3.179465 -0.88653
C  -5.001186 -1.453789 -2.610495
C  0.207215 -2.137815 -1.226496
C  -0.138478 2.796325 -0.579841
C  0.314961 4.075016 -0.205206
C  -3.345633 -2.212267 -0.977514
C  -0.801175 -2.693717 -0.549262
C  -2.171102 -2.435604 -0.81153
H  2.247164 -1.501334 1.634325
H  0.76192 -0.88361 0.926795
H  2.17047 -2.740618 -1.810109
H  1.753017 -3.180775 -0.146356
H  3.793926 -0.076729 2.601553
H  0.085347 0.705131 -0.4001
H  4.12025 -1.595258 -1.468179
H  4.079485 -2.180684 0.212983
H  4.297315 -0.447372 -0.129549
H  3.408778 4.173158 2.385903
H  4.521943 2.173625 3.30233
H  1.718894 5.177157 0.958702
H  -5.016579 -1.108025 0.843696
H  -6.22726 -0.563518 -0.319659
H  -4.595223 0.106457 -0.36717
H  -5.317055 -3.992314 -1.560783
H  -5.44807 -3.526815 0.137654
H  -6.651256 -2.968422 -1.026305
H  -4.712909 -2.222346 -3.328712
H  -6.059361 -1.232855 -2.761582
H  -4.434184 -0.549634 -2.836089
H  0.006777 -1.459497 -2.049668
H  -0.98281 2.703008 -1.250532
H  -0.176347 4.956663 -0.595742
H  -0.584573 -3.378314 0.266622
H  2.122423 -0.432033 -1.090491
elementType: N C H
totalener: -870.50829414 hartree
nucrepener: 1660.77770893 hartree
electener: -2531.28600307 hartree
oneelecener: -4452.92490293 hartree
twoeener: 1921.63889986 hartree
cpcmener: -0.09728280 hartree
kineticenergy: 866.19388501 hartree
xcener: -89.063400714231 hartree
chargesum: 1.0000000
charge: 0.204216 -0.138063 0.027916 -0.062806 -0.041185 0.055658 -0.057611 -0.146702 -0.213980 -0.198594 -0.120649 -0.128838 -0.091467 -0.287716 -0.287484 -0.286830 -0.169916 -0.157225 -0.145467 -0.249451 -0.217139 0.235341 0.149827 0.181626 0.142817 0.137197 0.144582 0.158264 0.140149 0.140278 0.142548 0.145015 0.159255 0.143696 0.102161 0.098685 0.100964 0.101939 0.101252 0.098209 0.101717 0.098430 0.099416 0.148193 0.156163 0.159458 0.145719 0.180431
qa: 0.2042 -0.1381 0.0279 -0.0628 -0.0412 0.0557 -0.0576 -0.1467 -0.2140 -0.1986 -0.1206 -0.1288 -0.0915 -0.2877 -0.2875 -0.2868 -0.1699 -0.1572 -0.1455 -0.2495 -0.2171 0.2353 0.1498 0.1816 0.1428 0.1372 0.1446 0.1583 0.1401 0.1403 0.1425 0.1450 0.1593 0.1437 0.1022 0.0987 0.1010 0.1019 0.1013 0.0982 0.1017 0.0984 0.0994 0.1482 0.1562 0.1595 0.1457 0.1804
va: 3.6190 3.7918 3.4355 3.9025 3.9089 4.0323 3.8677 3.9277 3.9323 3.8655 3.9356 3.9007 3.8781 3.8963 3.8948 3.8939 3.8634 3.9661 3.9087 4.0720 4.0024 3.6692 1.0076 0.9740 0.9949 1.0021 1.0022 0.9896 0.9965 0.9939 0.9917 1.0038 0.9905 1.0049 1.0055 1.0034 1.0056 1.0055 1.0056 1.0032 1.0054 1.0035 1.0061 1.0055 0.9943 0.9898 0.9981 0.9917
dispersion: -0.021188186 hartree
energy: -870.529482330287 hartree
dipole: -14.24524 18.03367 3.78843 -13.46094 11.55935 -1.90159 -7.29113 6.68895 -0.60218
magnitude: 4.28146 au
magnitude: 10.88260 debye
