program: Orca
programVersion: 5.0.2
elementType: N C C C C C C C C C C C C C C C C C C C C C H H H H H H H H H H H H H H H H H H H H H H H H H H
charge: 1
multiplicity: 1
keywords: wb97x-d3
keywords: def2-TZVPP
keywords: def2/J RIJCOSX
keywords: DEFGRID2
keywords: scfconv7
keywords: smallprint printgap noloewdin
keywords: NOSOSCF
formula: C21H26N
InChI: InChI=1/C21H26N/c1-21(2,3)15-8-5-9-16-22(4)17-19-13-10-12-18-11-6-7-14-20(18)19/h5-7,9-14,22H,16-17H2,1-4H3
48 atoms
N  2.027494 -1.511469 0.495641
C  1.933615 -0.439473 1.543908
C  2.622666 0.824648 1.112621
C  1.915687 2.016445 0.778013
C  2.664687 3.152154 0.357374
C  -4.990688 -2.47589 -1.007949
C  1.302158 -1.197855 -0.785524
C  3.994997 0.807247 1.04797
C  0.506609 2.144052 0.853597
C  1.641894 -2.830852 1.051918
C  4.073647 3.077994 0.285357
C  4.72859 1.929619 0.628131
C  1.989443 4.348255 0.018943
C  -5.574192 -1.21999 -0.352753
C  -5.334881 -3.710979 -0.166496
C  -5.557594 -2.637156 -2.423274
C  -0.178536 -1.234214 -0.642634
C  -0.117243 3.315809 0.522681
C  0.628279 4.431878 0.097118
C  -3.533411 -2.350702 -1.086783
C  -0.91668 -2.18566 -1.221817
C  -2.331698 -2.251916 -1.142232
H  2.422758 -0.848962 2.427275
H  0.881832 -0.318348 1.787911
H  1.652111 -0.218535 -1.113036
H  1.644674 -1.935956 -1.509679
H  4.53392 -0.09047 1.332574
H  -0.101257 1.315556 1.18897
H  2.332603 -3.084153 1.851268
H  1.700895 -3.579882 0.266667
H  0.629301 -2.782806 1.441575
H  4.627572 3.950795 -0.038768
H  5.80826 1.877408 0.585274
H  2.574542 5.201615 -0.30214
H  -5.185895 -1.078841 0.656796
H  -6.660199 -1.306815 -0.285892
H  -5.344616 -0.324752 -0.932055
H  -4.929057 -4.621148 -0.60992
H  -4.943125 -3.62431 0.847813
H  -6.418609 -3.823893 -0.099844
H  -6.643877 -2.734305 -2.378583
H  -5.323395 -1.773939 -3.047455
H  -5.159989 -3.527273 -2.912506
H  -0.660257 -0.443585 -0.079895
H  -1.194828 3.38694 0.593332
H  0.120674 5.351767 -0.162045
H  -0.428981 -2.968004 -1.797529
H  3.014813 -1.582397 0.23598
elementType: N C H
totalener: -870.50506032 hartree
nucrepener: 1648.71590768 hartree
electener: -2519.22096800 hartree
oneelecener: -4428.95767098 hartree
twoeener: 1909.73670299 hartree
cpcmener: -0.09918662 hartree
kineticenergy: 866.20386505 hartree
xcener: -89.066109933923 hartree
chargesum: 1.0000000
charge: 0.221416 -0.101646 0.034742 -0.061140 -0.009608 0.058617 -0.103371 -0.165966 -0.231158 -0.211959 -0.120902 -0.148237 -0.085807 -0.289006 -0.288097 -0.287991 -0.160373 -0.146048 -0.145026 -0.255515 -0.197690 0.229885 0.156352 0.150504 0.158516 0.150037 0.143828 0.154994 0.145224 0.142128 0.138132 0.145261 0.159853 0.143374 0.100319 0.098351 0.101469 0.101709 0.101155 0.098408 0.098532 0.101641 0.101610 0.139856 0.157738 0.160042 0.138441 0.177406
qa: 0.2214 -0.1016 0.0347 -0.0611 -0.0096 0.0586 -0.1034 -0.1660 -0.2312 -0.2120 -0.1209 -0.1482 -0.0858 -0.2890 -0.2881 -0.2880 -0.1604 -0.1460 -0.1450 -0.2555 -0.1977 0.2299 0.1564 0.1505 0.1585 0.1500 0.1438 0.1550 0.1452 0.1421 0.1381 0.1453 0.1599 0.1434 0.1003 0.0984 0.1015 0.1017 0.1012 0.0984 0.0985 0.1016 0.1016 0.1399 0.1577 0.1600 0.1384 0.1774
va: 3.6151 3.8050 3.5145 3.7607 3.8571 4.0310 3.8965 3.9564 3.9191 3.8816 3.9310 3.9126 3.8744 3.8952 3.8964 3.8959 3.8437 3.9339 3.9098 4.0848 4.0225 3.6708 0.9947 0.9962 0.9885 0.9978 1.0014 1.0028 0.9958 0.9927 0.9890 1.0042 0.9905 1.0053 1.0057 1.0036 1.0054 1.0054 1.0053 1.0034 1.0032 1.0055 1.0053 1.0173 0.9930 0.9895 1.0033 0.9929
dispersion: -0.021169506 hartree
energy: -870.526229826320 hartree
dipole: -19.80289 22.98913 3.18624 -18.48926 15.95448 -2.53478 -1.79775 2.68138 0.88364
magnitude: 4.16630 au
magnitude: 10.58989 debye
