program: Orca
programVersion: 5.0.2
elementType: N C C C C C C C C C C C C C C C C C C C C C H H H H H H H H H H H H H H H H H H H H H H H H H H
charge: 1
multiplicity: 1
keywords: wb97x-d3
keywords: def2-TZVPP
keywords: def2/J RIJCOSX
keywords: DEFGRID2
keywords: scfconv7
keywords: smallprint printgap noloewdin
keywords: NOSOSCF
formula: C21H26N
InChI: InChI=1/C21H26N/c1-21(2,3)15-8-5-9-16-22(4)17-19-13-10-12-18-11-6-7-14-20(18)19/h5-7,9-14,22H,16-17H2,1-4H3
48 atoms
N  1.961377 -1.477752 0.648243
C  1.880171 -0.32705 1.610677
C  2.625275 0.877756 1.109208
C  1.968907 2.05286 0.639769
C  2.768057 3.134069 0.171914
C  -5.048921 -2.506527 -0.904767
C  1.247386 -1.251877 -0.657361
C  3.998225 0.825347 1.122101
C  0.561522 2.214656 0.625506
C  1.552317 -2.744544 1.302042
C  4.176539 3.025377 0.187868
C  4.78203 1.894825 0.657156
C  2.142507 4.312271 -0.298853
C  -5.685307 -1.238141 -1.484148
C  -5.457092 -2.667703 0.564544
C  -5.500798 -3.730572 -1.708296
C  -0.235028 -1.277777 -0.527597
C  -0.013924 3.367786 0.166714
C  0.781527 4.429568 -0.304835
C  -3.590205 -2.394321 -0.979738
C  -0.970838 -2.246561 -1.080313
C  -2.387403 -2.300945 -1.018961
H  2.331459 -0.685229 2.535349
H  0.827819 -0.150288 1.815036
H  1.601867 -0.296891 -1.046717
H  1.595543 -2.037302 -1.327107
H  4.49714 -0.057969 1.506777
H  -0.082775 1.430449 0.997097
H  1.584653 -3.549612 0.57256
H  0.54564 -2.644666 1.697641
H  2.246715 -2.955279 2.110502
H  4.769617 3.858404 -0.169846
H  5.86081 1.817448 0.680996
H  2.765174 5.125069 -0.65288
H  -5.383071 -0.349954 -0.927835
H  -6.773052 -1.31315 -1.431864
H  -5.408708 -1.094297 -2.529325
H  -5.018468 -3.564571 1.003885
H  -5.144261 -1.809935 1.161202
H  -6.542733 -2.751799 0.641147
H  -5.223621 -3.641901 -2.759496
H  -5.059564 -4.648687 -1.318211
H  -6.586502 -3.83014 -1.654308
H  -0.720854 -0.464634 -0.001274
H  -1.091635 3.466818 0.171204
H  0.312076 5.335588 -0.664978
H  -0.480272 -3.053841 -1.617861
H  2.948791 -1.58301 0.401224
elementType: N C H
totalener: -870.50519022 hartree
nucrepener: 1646.04602724 hartree
electener: -2516.55121745 hartree
oneelecener: -4423.59963012 hartree
twoeener: 1907.04841266 hartree
cpcmener: -0.09934602 hartree
kineticenergy: 866.20311871 hartree
xcener: -89.065707836622 hartree
chargesum: 1.0000000
charge: 0.220292 -0.101038 0.049019 -0.077211 -0.010237 0.053789 -0.101774 -0.171410 -0.224480 -0.210662 -0.122541 -0.145956 -0.087208 -0.285875 -0.286178 -0.288033 -0.161940 -0.149324 -0.142798 -0.259736 -0.193690 0.232294 0.155921 0.150353 0.158847 0.149407 0.144772 0.156954 0.141735 0.138158 0.145014 0.145769 0.159877 0.143385 0.100559 0.098627 0.102388 0.101199 0.100561 0.098591 0.101487 0.100601 0.098096 0.139277 0.157580 0.159815 0.138552 0.177171
qa: 0.2203 -0.1010 0.0490 -0.0772 -0.0102 0.0538 -0.1018 -0.1714 -0.2245 -0.2107 -0.1225 -0.1460 -0.0872 -0.2859 -0.2862 -0.2880 -0.1619 -0.1493 -0.1428 -0.2597 -0.1937 0.2323 0.1559 0.1504 0.1588 0.1494 0.1448 0.1570 0.1417 0.1382 0.1450 0.1458 0.1599 0.1434 0.1006 0.0986 0.1024 0.1012 0.1006 0.0986 0.1015 0.1006 0.0981 0.1393 0.1576 0.1598 0.1386 0.1772
va: 3.6170 3.8041 3.5024 3.7731 3.8571 4.0393 3.8939 3.9633 3.9139 3.8812 3.9334 3.9111 3.8754 3.8918 3.8940 3.8941 3.8504 3.9399 3.9088 4.0822 4.0190 3.6673 0.9944 0.9966 0.9879 0.9985 1.0013 1.0032 0.9927 0.9889 0.9957 1.0041 0.9905 1.0053 1.0059 1.0034 1.0055 1.0056 1.0058 1.0036 1.0057 1.0057 1.0033 1.0172 0.9934 0.9895 1.0034 0.9926
dispersion: -0.021114338 hartree
energy: -870.526304553671 hartree
dipole: -20.34757 23.43195 3.08438 -18.34820 15.88754 -2.46065 -0.63424 1.78623 1.15199
magnitude: 4.11039 au
magnitude: 10.44778 debye
