program: Orca
programVersion: 5.0.2
elementType: N C C C C C C C C C C C C C C C C C C C C C H H H H H H H H H H H H H H H H H H H H H H H H H H
charge: 1
multiplicity: 1
keywords: wb97x-d3
keywords: def2-TZVPP
keywords: def2/J RIJCOSX
keywords: DEFGRID2
keywords: scfconv7
keywords: smallprint printgap noloewdin
keywords: NOSOSCF
formula: C21H26N
InChI: InChI=1/C21H26N/c1-21(2,3)15-8-5-9-16-22(4)17-19-13-10-12-18-11-6-7-14-20(18)19/h5-7,9-14,22H,16-17H2,1-4H3
48 atoms
N  2.425709 -1.323426 -0.309726
C  1.978212 -0.802632 1.031698
C  2.293516 0.649042 1.226615
C  1.466479 1.667729 0.664689
C  1.826795 3.027589 0.872319
C  -4.622051 -1.686073 -1.024003
C  1.711634 -2.599878 -0.669346
C  3.388023 0.99856 1.97702
C  0.293866 1.396605 -0.082331
C  3.896026 -1.497965 -0.375394
C  2.969773 3.338388 1.645075
C  3.729902 2.34619 2.19442
C  1.029698 4.053397 0.313649
C  -5.15723 -2.457561 -2.235659
C  -4.654976 -0.179374 -1.308569
C  -5.469107 -2.001142 0.213415
C  0.294527 -2.323464 -1.026335
C  -0.46115 2.411653 -0.605445
C  -0.08866 3.755548 -0.414043
C  -3.23638 -2.086875 -0.77261
C  -0.73651 -2.707991 -0.269275
C  -2.086933 -2.391735 -0.566886
H  2.481933 -1.417664 1.776388
H  0.910831 -0.998957 1.113838
H  2.251431 -3.027256 -1.514163
H  1.808204 -3.272942 0.182139
H  4.00229 0.221672 2.416493
H  -0.035818 0.377713 -0.239023
H  4.171184 -1.783711 -1.38692
H  4.19095 -2.275635 0.324585
H  4.384917 -0.562578 -0.120155
H  3.22727 4.379042 1.801773
H  4.596449 2.586646 2.795861
H  1.320126 5.084439 0.476176
H  -4.570142 -2.250626 -3.131408
H  -6.189647 -2.164132 -2.434296
H  -5.141612 -3.534193 -2.061552
H  -4.274309 0.393679 -0.461823
H  -4.057118 0.074228 -2.185132
H  -5.681132 0.141617 -1.496935
H  -5.462824 -3.068099 0.440092
H  -5.104797 -1.466185 1.091589
H  -6.504338 -1.700149 0.042417
H  0.121643 -1.76612 -1.941442
H  -1.356475 2.178087 -1.167403
H  -0.692419 4.54752 -0.83763
H  -0.555885 -3.27312 0.641332
H  2.176043 -0.629668 -1.021524
elementType: N C H
totalener: -870.50774150 hartree
nucrepener: 1678.09614842 hartree
electener: -2548.60388993 hartree
oneelecener: -4487.50921583 hartree
twoeener: 1938.90532590 hartree
cpcmener: -0.09720508 hartree
kineticenergy: 866.19722612 hartree
xcener: -89.063777008622 hartree
chargesum: 1.0000000
charge: 0.206654 -0.150078 0.058417 -0.083900 -0.036995 0.064457 -0.054192 -0.156187 -0.194723 -0.194113 -0.125213 -0.127411 -0.090752 -0.284808 -0.294619 -0.287978 -0.171645 -0.155065 -0.148717 -0.266754 -0.214614 0.244744 0.150286 0.181999 0.140117 0.137515 0.148484 0.138241 0.138862 0.138986 0.140212 0.145158 0.159436 0.143697 0.100664 0.098748 0.102342 0.100736 0.100301 0.101426 0.101771 0.101250 0.098323 0.150535 0.157267 0.160325 0.148011 0.178802
qa: 0.2067 -0.1501 0.0584 -0.0839 -0.0370 0.0645 -0.0542 -0.1562 -0.1947 -0.1941 -0.1252 -0.1274 -0.0908 -0.2848 -0.2946 -0.2880 -0.1716 -0.1551 -0.1487 -0.2668 -0.2146 0.2447 0.1503 0.1820 0.1401 0.1375 0.1485 0.1382 0.1389 0.1390 0.1402 0.1452 0.1594 0.1437 0.1007 0.0987 0.1023 0.1007 0.1003 0.1014 0.1018 0.1013 0.0983 0.1505 0.1573 0.1603 0.1480 0.1788
va: 3.6187 3.8169 3.4236 3.9264 3.8965 4.0310 3.8798 3.9234 3.9200 3.8655 3.9410 3.8999 3.8773 3.8918 3.8971 3.8946 3.8585 3.9572 3.9132 4.0739 3.9966 3.6442 1.0059 0.9715 0.9948 1.0020 1.0000 1.0100 0.9960 0.9939 0.9943 1.0039 0.9903 1.0049 1.0057 1.0033 1.0056 1.0054 1.0052 1.0043 1.0057 1.0052 1.0035 1.0053 0.9933 0.9900 0.9962 0.9919
dispersion: -0.021858552 hartree
energy: -870.529600056488 hartree
dipole: -13.12619 17.06605 3.93986 -12.65608 10.56322 -2.09286 -6.32075 5.88461 -0.43615
magnitude: 4.48250 au
magnitude: 11.39360 debye
