program: Orca
programVersion: 5.0.2
elementType: N C C C C C C C C C C C C C C C C C C C C C H H H H H H H H H H H H H H H H H H H H H H H H H H
charge: 1
multiplicity: 1
keywords: wb97x-d3
keywords: def2-TZVPP
keywords: def2/J RIJCOSX
keywords: DEFGRID2
keywords: scfconv7
keywords: smallprint printgap noloewdin
keywords: NOSOSCF
formula: C21H26N
InChI: InChI=1/C21H26N/c1-21(2,3)15-8-5-9-16-22(4)17-19-13-10-12-18-11-6-7-14-20(18)19/h5-7,9-14,22H,16-17H2,1-4H3
48 atoms
N  2.224848 -1.218539 -0.290905
C  1.709768 -0.630532 0.995095
C  2.22594 0.750314 1.256496
C  1.70367 1.881149 0.560996
C  2.247615 3.163757 0.842295
C  -4.91563 -2.084493 -0.934017
C  1.498627 -2.488584 -0.640236
C  3.207801 0.925055 2.198561
C  0.662017 1.793737 -0.394888
C  3.690659 -1.439202 -0.258492
C  3.262223 3.294081 1.818883
C  3.726423 2.200205 2.490521
C  1.758779 4.294652 0.149174
C  -5.142484 -1.585909 -2.364721
C  -5.388732 -1.024788 0.068569
C  -5.684196 -3.39129 -0.709827
C  0.070869 -2.229406 -0.969839
C  0.208728 2.907265 -1.048854
C  0.766312 4.171615 -0.782469
C  -3.485687 -2.326778 -0.722192
C  -0.935662 -2.731343 -0.249084
C  -2.307772 -2.512331 -0.534947
H  2.017433 -1.316867 1.782983
H  0.622236 -0.654383 0.943436
H  2.023117 -2.910887 -1.497745
H  1.613568 -3.166479 0.205368
H  3.592803 0.064549 2.732263
H  0.193412 0.842664 -0.61532
H  4.007888 -1.820303 -1.224364
H  3.923249 -2.16046 0.520029
H  4.196171 -0.500142 -0.058649
H  3.660829 4.27873 2.030788
H  4.495702 2.303878 3.243817
H  2.184834 5.265302 0.371166
H  -4.610095 -0.652505 -2.551366
H  -6.20603 -1.404577 -2.529221
H  -4.809285 -2.319119 -3.100093
H  -5.240011 -1.354966 1.097229
H  -4.855673 -0.082928 -0.066249
H  -6.453659 -0.831337 -0.072055
H  -5.362029 -4.167526 -1.404869
H  -5.545067 -3.765861 0.304899
H  -6.751816 -3.224321 -0.863497
H  -0.130226 -1.624213 -1.84798
H  -0.588904 2.814774 -1.774334
H  0.400836 5.042717 -1.309307
H  -0.715219 -3.341311 0.622729
H  2.04105 -0.552995 -1.046843
elementType: N C H
totalener: -870.50849978 hartree
nucrepener: 1651.82958047 hartree
electener: -2522.33808026 hartree
oneelecener: -4435.02515622 hartree
twoeener: 1912.68707596 hartree
cpcmener: -0.09758163 hartree
kineticenergy: 866.21084574 hartree
xcener: -89.066813508912 hartree
chargesum: 1.0000000
charge: 0.206440 -0.134383 0.003674 -0.052175 -0.045521 0.057245 -0.061435 -0.128262 -0.216836 -0.201900 -0.116597 -0.134954 -0.093247 -0.287488 -0.287302 -0.287942 -0.167726 -0.156148 -0.145572 -0.249561 -0.214078 0.233819 0.149119 0.181684 0.143235 0.138080 0.142815 0.158900 0.141598 0.141439 0.143035 0.146093 0.159086 0.144889 0.099690 0.098437 0.101434 0.101989 0.101070 0.098403 0.101617 0.101353 0.098243 0.146518 0.156630 0.160159 0.143808 0.180628
qa: 0.2064 -0.1344 0.0037 -0.0522 -0.0455 0.0572 -0.0614 -0.1283 -0.2168 -0.2019 -0.1166 -0.1350 -0.0932 -0.2875 -0.2873 -0.2879 -0.1677 -0.1561 -0.1456 -0.2496 -0.2141 0.2338 0.1491 0.1817 0.1432 0.1381 0.1428 0.1589 0.1416 0.1414 0.1430 0.1461 0.1591 0.1449 0.0997 0.0984 0.1014 0.1020 0.1011 0.0984 0.1016 0.1014 0.0982 0.1465 0.1566 0.1602 0.1438 0.1806
va: 3.6181 3.7846 3.4520 3.8910 3.9111 4.0313 3.8640 3.9238 3.9395 3.8662 3.9287 3.9077 3.8817 3.8942 3.8961 3.8964 3.8717 3.9623 3.9089 4.0719 4.0092 3.6725 1.0085 0.9740 0.9955 1.0020 1.0032 0.9887 0.9964 0.9939 0.9902 1.0034 0.9907 1.0046 1.0060 1.0035 1.0053 1.0055 1.0055 1.0034 1.0056 1.0056 1.0031 1.0069 0.9938 0.9896 0.9993 0.9927
dispersion: -0.020962216 hartree
energy: -870.529461998135 hartree
dipole: -15.38177 18.99502 3.61325 -14.54093 12.57377 -1.96716 -5.65030 5.26575 -0.38454
magnitude: 4.13197 au
magnitude: 10.50263 debye
