program: Orca
programVersion: 5.0.2
elementType: N C C C C C C C C C C C C C C C C C C C C C H H H H H H H H H H H H H H H H H H H H H H H H H H
charge: 1
multiplicity: 1
keywords: wb97x-d3
keywords: def2-TZVPP
keywords: def2/J RIJCOSX
keywords: DEFGRID2
keywords: scfconv7
keywords: smallprint printgap noloewdin
keywords: NOSOSCF
formula: C21H26N
InChI: InChI=1/C21H26N/c1-21(2,3)15-8-5-9-16-22(4)17-19-13-10-12-18-11-6-7-14-20(18)19/h5-7,9-14,22H,16-17H2,1-4H3
48 atoms
N  2.234398 -1.245878 -0.263855
C  1.761941 -0.644991 1.033153
C  2.274254 0.745291 1.250543
C  1.69269 1.862031 0.579798
C  2.237606 3.154269 0.81266
C  -4.910322 -2.050584 -0.972033
C  1.488444 -2.51183 -0.584127
C  3.314881 0.941773 2.12276
C  0.591576 1.752222 -0.304554
C  3.698309 -1.478051 -0.271862
C  3.315484 3.306614 1.715077
C  3.838261 2.225529 2.364189
C  1.686347 4.272915 0.147042
C  -5.153322 -2.057203 -2.485164
C  -5.293162 -0.684264 -0.390392
C  -5.741886 -3.151277 -0.304336
C  0.06408 -2.238611 -0.915981
C  0.078529 2.854465 -0.9329
C  0.633581 4.128955 -0.71246
C  -3.489664 -2.296597 -0.711074
C  -0.950731 -2.709523 -0.185999
C  -2.318136 -2.486953 -0.491647
H  2.107425 -1.316138 1.818667
H  0.673646 -0.680964 1.023269
H  2.002069 -2.959746 -1.435514
H  1.597012 -3.175111 0.274043
H  3.744973 0.091741 2.638587
H  0.12514 0.792586 -0.489281
H  3.986375 -1.866558 -1.243942
H  3.947171 -2.197654 0.503124
H  4.217918 -0.542806 -0.091263
H  3.715881 4.298078 1.888786
H  4.656597 2.345828 3.06102
H  2.112448 5.251081 0.333256
H  -4.567642 -1.285449 -2.986067
H  -6.207917 -1.866331 -2.691476
H  -4.893575 -3.020183 -2.926391
H  -5.124963 -0.648273 0.6865
H  -4.717946 0.119873 -0.850765
H  -6.35122 -0.488159 -0.572307
H  -5.490142 -4.136098 -0.699705
H  -5.58506 -3.168783 0.77476
H  -6.803785 -2.977348 -0.4870
H  -0.128543 -1.654453 -1.810059
H  -0.764626 2.745561 -1.6026
H  0.218718 4.991086 -1.21695
H  -0.742589 -3.297353 0.70398
H  2.033127 -0.58143 -1.016801
elementType: N C H
totalener: -870.50860105 hartree
nucrepener: 1653.06938633 hartree
electener: -2523.57798738 hartree
oneelecener: -4437.50587466 hartree
twoeener: 1913.92788727 hartree
cpcmener: -0.09761202 hartree
kineticenergy: 866.20846759 hartree
xcener: -89.066194853192 hartree
chargesum: 1.0000000
charge: 0.208343 -0.138069 0.019726 -0.057746 -0.042439 0.055003 -0.060154 -0.139138 -0.216444 -0.201844 -0.120659 -0.131210 -0.092496 -0.287153 -0.286573 -0.288028 -0.169560 -0.155576 -0.145296 -0.251608 -0.213752 0.236462 0.150021 0.180441 0.142271 0.138072 0.143462 0.158143 0.141192 0.141482 0.142639 0.146160 0.159166 0.144606 0.099777 0.098257 0.102221 0.101924 0.100630 0.098583 0.101757 0.100939 0.097954 0.146992 0.156882 0.159493 0.144830 0.180318
qa: 0.2083 -0.1381 0.0197 -0.0577 -0.0424 0.0550 -0.0602 -0.1391 -0.2164 -0.2018 -0.1207 -0.1312 -0.0925 -0.2872 -0.2866 -0.2880 -0.1696 -0.1556 -0.1453 -0.2516 -0.2138 0.2365 0.1500 0.1804 0.1423 0.1381 0.1435 0.1581 0.1412 0.1415 0.1426 0.1462 0.1592 0.1446 0.0998 0.0983 0.1022 0.1019 0.1006 0.0986 0.1018 0.1009 0.0980 0.1470 0.1569 0.1595 0.1448 0.1803
va: 3.6177 3.7927 3.4379 3.8971 3.9082 4.0346 3.8661 3.9269 3.9382 3.8665 3.9319 3.9042 3.8794 3.8924 3.8951 3.8950 3.8675 3.9623 3.9096 4.0748 4.0053 3.6711 1.0080 0.9744 0.9953 1.0020 1.0026 0.9895 0.9966 0.9936 0.9907 1.0035 0.9905 1.0047 1.0060 1.0036 1.0054 1.0056 1.0056 1.0034 1.0055 1.0056 1.0034 1.0064 0.9938 0.9898 0.9987 0.9923
dispersion: -0.021007451 hartree
energy: -870.529608503541 hartree
dipole: -15.28495 18.92553 3.64058 -14.49626 12.48332 -2.01294 -5.93557 5.56362 -0.37195
magnitude: 4.17662 au
magnitude: 10.61612 debye
