program: Orca
programVersion: 5.0.2
elementType: N C C C C C C C C C C C C C C C C C C C C C H H H H H H H H H H H H H H H H H H H H H H H H H H
charge: 1
multiplicity: 1
keywords: wb97x-d3
keywords: def2-TZVPP
keywords: def2/J RIJCOSX
keywords: DEFGRID2
keywords: scfconv7
keywords: smallprint printgap noloewdin
keywords: NOSOSCF
formula: C21H26N
InChI: InChI=1/C21H26N/c1-21(2,3)15-8-5-9-16-22(4)17-19-13-10-12-18-11-6-7-14-20(18)19/h5-7,9-14,22H,16-17H2,1-4H3
48 atoms
N  2.343634 -1.284677 -0.348595
C  2.060306 -0.897452 1.077958
C  2.344713 0.548414 1.347326
C  1.438508 1.567465 0.927276
C  1.769651 2.923831 1.194894
C  -4.590493 -1.663073 -1.198744
C  1.736233 -2.614909 -0.707548
C  3.489764 0.890244 2.021289
C  0.216707 1.297912 0.263063
C  3.7937 -1.266167 -0.654519
C  2.965015 3.228436 1.886161
C  3.804106 2.233598 2.298897
C  0.891907 3.950396 0.776653
C  -5.06494 -2.247089 0.136105
C  -5.301454 -2.365959 -2.360522
C  -4.882628 -0.158004 -1.243332
C  0.251097 -2.595992 -0.556022
C  -0.615143 2.313325 -0.124998
C  -0.274096 3.655572 0.12694
C  -3.145775 -1.866418 -1.325248
C  -0.546418 -2.158726 -1.535386
C  -1.953097 -2.03078 -1.413296
H  2.678911 -1.544561 1.698776
H  1.019217 -1.143171 1.279933
H  2.029783 -2.811091 -1.738046
H  2.205813 -3.358388 -0.064579
H  4.167624 0.111205 2.349161
H  -0.088201 0.279041 0.06079
H  3.93326 -1.505243 -1.70521
H  4.295463 -2.005316 -0.034971
H  4.196041 -0.277948 -0.45447
H  3.201323 4.266077 2.089128
H  4.712978 2.468752 2.836458
H  1.159363 4.979577 0.983869
H  -4.574771 -1.76015 0.980171
H  -4.861518 -3.316924 0.197716
H  -6.141506 -2.103146 0.243166
H  -6.380527 -2.226638 -2.273431
H  -4.986978 -1.961514 -3.323388
H  -5.100173 -3.437902 -2.360626
H  -5.955827 0.013275 -1.142041
H  -4.379928 0.370313 -0.431917
H  -4.559092 0.282839 -2.187098
H  -0.169935 -2.918984 0.388432
H  -1.546208 2.081233 -0.626351
H  -0.939253 4.44858 -0.188214
H  -0.112971 -1.852748 -2.484699
H  1.899479 -0.592041 -0.958121
elementType: N C H
totalener: -870.50679659 hartree
nucrepener: 1681.94182399 hartree
electener: -2552.44862058 hartree
oneelecener: -4495.12558623 hartree
twoeener: 1942.67696565 hartree
cpcmener: -0.09605067 hartree
kineticenergy: 866.20427918 hartree
xcener: -89.065521930179 hartree
chargesum: 1.0000000
charge: 0.200339 -0.130082 0.034055 -0.069758 -0.038442 0.070500 -0.076011 -0.149991 -0.195147 -0.200300 -0.124719 -0.123808 -0.087665 -0.288595 -0.288111 -0.294538 -0.152580 -0.151838 -0.151123 -0.253977 -0.235543 0.246006 0.150314 0.174743 0.142161 0.145840 0.145285 0.134372 0.141199 0.140404 0.143598 0.144518 0.160005 0.143151 0.099624 0.101977 0.098419 0.098658 0.101357 0.102531 0.102035 0.098922 0.102698 0.147649 0.157161 0.159782 0.146283 0.178641
qa: 0.2003 -0.1301 0.0341 -0.0698 -0.0384 0.0705 -0.0760 -0.1500 -0.1951 -0.2003 -0.1247 -0.1238 -0.0877 -0.2886 -0.2881 -0.2945 -0.1526 -0.1518 -0.1511 -0.2540 -0.2355 0.2460 0.1503 0.1747 0.1422 0.1458 0.1453 0.1344 0.1412 0.1404 0.1436 0.1445 0.1600 0.1432 0.0996 0.1020 0.0984 0.0987 0.1014 0.1025 0.1020 0.0989 0.1027 0.1476 0.1572 0.1598 0.1463 0.1786
va: 3.6313 3.7996 3.4473 3.9337 3.8915 4.0243 3.8740 3.9294 3.9293 3.8620 3.9374 3.8949 3.8757 3.8962 3.8965 3.8981 3.8587 3.9552 3.9163 4.0727 3.9995 3.6407 1.0067 0.9753 0.9984 1.0005 1.0020 1.0173 0.9962 0.9950 0.9910 1.0043 0.9900 1.0051 1.0053 1.0053 1.0037 1.0031 1.0054 1.0053 1.0043 1.0056 1.0049 1.0059 0.9928 0.9903 0.9985 0.9959
dispersion: -0.022035696 hartree
energy: -870.528832283969 hartree
dipole: -13.32150 17.10592 3.78442 -12.79889 10.79120 -2.00769 -6.39718 5.89293 -0.50425
magnitude: 4.31357 au
magnitude: 10.96424 debye
