program: Gaussian 09
title: 000070931
version: EM64L-G09RevD.01
frameworkgroup: C1[X(C12H26O6)]
method: RPBEPBE
basis: SDD
operation: Freq
keyword: #pfreq=noraman
keyword: PBEPBE/SDD
title: #p freq=noraman PBEPBE/SDD
converged: YES YES NO NO
title: Mulliken charges:
elementType: O O O O O O C C C C C C C C C C C C H H H H H H H H H H H H H H H H H H H H H H H H H H
charge: -0.271488 -0.271492 -0.262536 -0.262541 -0.267891 -0.267892 -0.245832 -0.245855 -0.246268 -0.246269 -0.249059 -0.249063 -0.239131 -0.239134 -0.266355 -0.266355 -0.503434 -0.503438 0.206619 0.177730 0.206607 0.177749 0.168379 0.214121 0.168371 0.214131 0.182959 0.193888 0.182973 0.193878 0.179845 0.202701 0.179851 0.202696 0.177651 0.215109 0.177649 0.215112 0.231588 0.191867 0.209551 0.231588 0.191865 0.209556
chargesum: 0.00000
title: Mulliken charges with hydrogens summed into heavy atoms:
elementType: O O O O O O C C C C C C C C C C C C
charge: -0.271488 -0.271492 -0.262536 -0.262541 -0.267891 -0.267892 0.138517 0.138501 0.136232 0.136233 0.127788 0.127788 0.143415 0.143413 0.126405 0.126406 0.129573 0.129570
polarizability: 1.80210314e+02 -2.53910042e-03 1.61039049e+02 -1.16071939e-05 -2.49919990e-01 1.28926488e+02
1716.lowfreq: 0.0003 0.0007 0.0007 3.1673 6.7202 7.3671 22.5060 23.0361 36.3365
frequency: 22.4447 23.0233 36.2383 36.9143 41.7359 47.5122 55.4662 65.7758 71.8078 74.2298 100.7482 108.7332 135.1793 148.7009 160.5378 183.0030 194.8910 199.7940 213.9349 235.9180 236.3389 276.5295 276.8986 282.9678 306.1618 339.2509 349.3683 352.5820 476.6714 493.0183 507.9668 538.3988 551.0143 781.3218 791.0733 794.5040 801.6402 807.7772 808.7152 916.6174 930.4259 931.8749 935.7189 999.7116 1000.6611 1029.2506 1032.6845 1038.5272 1038.8414 1060.1514 1062.2437 1064.4019 1066.5470 1073.0585 1084.2418 1105.2573 1110.1103 1110.5962 1114.4230 1121.6086 1123.6168 1129.5099 1159.2236 1160.2692 1190.5870 1198.4907 1199.6215 1201.4229 1208.5908 1245.5214 1249.9479 1252.2425 1255.5453 1257.0881 1330.6330 1337.8118 1341.5328 1345.4232 1370.8918 1371.1481 1388.2263 1401.1479 1410.7286 1417.5650 1435.1337 1437.8349 1450.7013 1451.2582 1451.7686 1452.2188 1453.3313 1456.4294 1457.4366 1460.3232 1469.9163 1471.9099 1472.9720 1473.5713 1476.5509 1479.5397 2908.4995 2910.3213 2910.5187 2911.9662 2915.4288 2917.2346 2918.0311 2926.4623 2927.7820 2932.2082 2934.2687 2937.4786 2973.8628 2974.0640 2976.5541 2977.1363 2982.8962 2983.7983 2984.7371 2987.3549 2987.8260 2990.3307 2990.9279 2995.4404 3099.9017 3101.4542
redmass: 4.1271 4.6367 3.2724 5.6518 2.8414 3.8368 3.0332 3.8241 2.9645 3.7281 3.1245 3.2101 3.3505 3.2183 3.7870 3.0660 2.1590 2.1647 2.1912 1.2953 1.2924 2.3960 2.4452 2.9069 2.9193 2.7700 2.7115 2.4886 2.4273 2.6795 2.7837 2.7215 2.8385 2.4958 2.6315 2.4979 2.4674 2.9993 2.9457 2.2657 2.0945 2.2160 2.1046 2.5388 2.4919 2.6816 2.4214 2.5976 2.4782 2.7309 2.8128 2.4772 3.5871 3.4647 3.1115 3.3769 1.8348 1.8653 2.6416 1.8755 1.7777 2.0557 1.3885 1.3981 1.0834 1.1416 1.1402 1.1225 1.1355 1.1139 1.1144 1.1276 1.1260 1.1276 1.1956 1.2187 1.2500 1.3080 1.3126 1.3279 1.3920 1.4641 1.5506 1.5907 1.1482 1.1580 1.0836 1.0837 1.0838 1.0846 1.0646 1.0551 1.0585 1.0825 1.0854 1.0882 1.0874 1.0814 1.0755 1.0603 1.0424 1.0501 1.0570 1.0551 1.0551 1.0561 1.0470 1.0575 1.0584 1.0576 1.0572 1.0591 1.1035 1.1036 1.1042 1.1047 1.1005 1.1008 1.1018 1.1024 1.1010 1.0993 1.1010 1.1007 1.0960 1.0964
irintensity: 0.1581 1.9598 0.1582 0.6634 2.6662 4.4172 0.0002 8.0764 0.5842 2.2013 8.1743 12.0577 4.9182 13.6712 5.3959 0.0381 3.2095 0.8080 6.3363 7.5521 1.0984 5.8273 5.0141 0.0786 1.0756 0.5670 0.0096 0.3186 6.2467 14.5325 1.9303 0.7567 0.5512 4.1847 10.6492 0.0178 9.9566 0.0248 39.0125 0.0747 7.8273 39.3081 66.6288 17.8980 25.3393 6.1827 9.1051 9.6373 1.0255 1.6433 37.3456 60.9604 11.2690 286.3019 129.7013 0.0053 26.1665 1.1624 36.7058 0.0106 18.2354 27.6262 2.3092 10.3512 5.9816 2.7369 4.1153 25.3790 8.7836 3.2828 7.0837 4.7601 17.5620 2.7335 19.2278 76.7288 12.3910 0.0225 5.9961 1.1813 6.7965 0.2043 3.9764 3.3343 1.3352 0.4611 8.2370 0.6838 31.6830 10.9258 0.1194 28.2943 22.6905 11.1993 3.5139 5.4709 1.0051 17.5606 12.8560 1.6075 30.9848 29.9407 16.3390 7.1990 32.9307 57.8352 32.1561 30.5115 269.9988 111.0276 144.4776 138.2261 170.0093 2.6650 74.7136 2.3815 168.6703 51.8785 72.3023 37.7970 59.0788 135.2836 9.9153 34.3615 60.2599 17.0906
temp: 298.150 k
press: 1.00000 atm
elementType: 8 8 8 8 8 8 6 6 6 6 6 6 6 6 6 6 6 6 1 1 1 1 1 1 1 1 1 1 1 1 1 1 1 1 1 1 1 1 1 1 1 1 1 1
symmnumber: 1
zpe: 985184.0 jmol-1
zpe.correction: 0.375237 hartree
zpe.thermalcorrener: 0.398634 hartree
zpe.thermalcorrenthalpy: 0.399578 hartree
zpe.thermalcorrgfe: 0.317944 hartree
zpe.sumelectzpe: -922.559269 hartree
zpe.sumelectthermal: -922.535872 hartree
zpe.sumelectthermalent: -922.534928 hartree
zpe.sumelectthermalfe: -922.616562 hartree
dipole: 1.0000 -0.0006 0.0001
dipole: 1.0000
quadrupole: -89.7376 -106.2004 -107.3396
quadrupole: -0.0030 0.0004 7.0489
quadrupole: 11.3550 -5.1079 -6.2471 -0.0030 0.0004 7.0489
hfenergy: -922.9345058 hartree
pointgroup: C01 [X(C12H26O6)]
dipole: -0.0004518 -0.3934171 0.000012 debye
polarizability: 160.9377439|0.0137133|180.210305|1.8181458|-0.0001948|129.0278019 unknown
InChI: InChI=1S/C12H26O6/c1-13-3-5-15-7-9-17-11-12-18-10-8-16-6-4-14-2/h3-12H2,1-2H3
charge 0 multiplicity 1
44 atoms
O  -1.507208 -2.772339 -0.355282
O  1.503226 -2.774709 0.355384
O  -2.673442 -0.024105 -0.108524
O  2.673577 -0.028268 0.108144
O  -2.717483 3.004256 0.342445
O  2.722004 3.000131 -0.342179
C  -0.693269 -3.784775 0.323173
C  0.687558 -3.786049 -0.322644
C  -2.696716 -2.386063 0.405915
C  2.69301 -2.390275 -0.40631
C  -3.399697 -1.26987 -0.354629
C  3.398037 -1.275148 0.353914
C  -3.033228 1.038524 -1.048574
C  3.034974 1.033637 1.048393
C  -2.140306 2.237545 -0.765771
C  2.143793 2.234029 0.765921
C  -1.81929 4.055215 0.805409
C  1.825347 4.052541 -0.804818
H  -0.582473 -3.550203 1.40347
H  -1.173824 -4.78465 0.224165
H  0.577123 -3.551729 -1.403032
H  1.166456 -4.786677 -0.223251
H  -3.385482 -3.254945 0.519632
H  -2.412537 -2.0230 1.416838
H  3.380408 -3.260206 -0.520292
H  2.408963 -2.026802 -1.417121
H  -4.452983 -1.175121 -0.006538
H  -3.406049 -1.51855 -1.439047
H  4.451302 -1.182007 0.005331
H  3.404519 -1.523846 1.438326
H  -2.8682 0.686785 -2.092217
H  -4.099773 1.334223 -0.938323
H  2.869502 0.681912 2.091969
H  4.101941 1.327805 0.938136
H  -2.066916 2.88458 -1.669801
H  -1.124059 1.867617 -0.507878
H  2.071444 2.880978 1.670099
H  1.126973 1.865668 0.508045
H  -2.347663 4.579498 1.617256
H  -1.578171 4.78098 -0.003439
H  -0.867892 3.63383 1.196894
H  2.354433 4.576218 -1.616593
H  1.585389 4.778485 0.004216
H  0.873282 3.632679 -1.196315
