program: Orca
programVersion: 5.0.2
elementType: N C C C C C C C C C C C C C C C C C C C C C H H H H H H H H H H H H H H H H H H H H H H H H H H
charge: 1
multiplicity: 1
keywords: wb97x-d3
keywords: def2-TZVPP
keywords: def2/J RIJCOSX
keywords: DEFGRID2
keywords: scfconv7
keywords: smallprint printgap noloewdin
keywords: NOSOSCF
formula: C21H26N
InChI: InChI=1/C21H26N/c1-21(2,3)15-8-5-9-16-22(4)17-19-13-10-12-18-11-6-7-14-20(18)19/h5-7,9-14,22H,16-17H2,1-4H3
48 atoms
N  2.329298 -1.263344 -0.362533
C  2.047771 -0.888636 1.067181
C  2.350956 0.550218 1.351837
C  1.46579 1.585484 0.92713
C  1.814907 2.934996 1.205755
C  -4.627654 -1.71492 -1.188269
C  1.719507 -2.588978 -0.733752
C  3.492482 0.869938 2.042149
C  0.248168 1.338043 0.247008
C  3.779307 -1.2454 -0.669458
C  3.005203 3.216875 1.915376
C  3.822707 2.206545 2.333917
C  0.960142 3.977476 0.779455
C  -5.015508 -1.686445 0.294114
C  -5.326942 -2.886291 -1.888136
C  -5.02662 -0.394656 -1.857322
C  0.235997 -2.576685 -0.566553
C  -0.561651 2.36867 -0.147957
C  -0.201393 3.704231 0.112485
C  -3.178171 -1.887483 -1.30602
C  -0.574623 -2.129145 -1.530814
C  -1.982419 -2.024225 -1.397494
H  2.656119 -1.550864 1.682133
H  1.002686 -1.122533 1.263457
H  2.003261 -2.769925 -1.769703
H  2.196219 -3.340738 -0.105946
H  4.154487 0.07863 2.37309
H  -0.07317 0.324929 0.03945
H  3.917184 -1.478226 -1.721791
H  4.280381 -1.988903 -0.05463
H  4.182919 -0.258773 -0.463788
H  3.255229 4.249478 2.127394
H  4.727811 2.424507 2.885042
H  1.241055 5.001395 0.995058
H  -4.737281 -2.613369 0.797239
H  -6.095446 -1.562063 0.392574
H  -4.533229 -0.85927 0.816778
H  -6.40967 -2.768483 -1.815177
H  -5.064468 -2.93286 -2.945739
H  -5.061502 -3.840032 -1.430381
H  -4.535604 0.456587 -1.383463
H  -4.765774 -0.389548 -2.916358
H  -6.105336 -0.248797 -1.775698
H  -0.174443 -2.919585 0.375663
H  -1.489451 2.153473 -0.662374
H  -0.849143 4.509366 -0.208751
H  -0.153256 -1.803341 -2.479048
H  1.886692 -0.5642 -0.965894
elementType: N C H
totalener: -870.50683079 hartree
nucrepener: 1678.78434065 hartree
electener: -2549.29117144 hartree
oneelecener: -4488.82504916 hartree
twoeener: 1939.53387772 hartree
cpcmener: -0.09601597 hartree
kineticenergy: 866.20315314 hartree
xcener: -89.065338149103 hartree
chargesum: 1.0000000
charge: 0.199060 -0.128395 0.028201 -0.066095 -0.039978 0.058237 -0.076419 -0.145756 -0.199620 -0.200669 -0.124181 -0.124839 -0.086354 -0.287817 -0.286598 -0.289112 -0.152110 -0.152506 -0.151538 -0.253433 -0.237784 0.255165 0.150161 0.175269 0.142428 0.146037 0.145055 0.136473 0.141293 0.140628 0.143710 0.144496 0.159859 0.143199 0.101331 0.098525 0.099947 0.098471 0.101883 0.102514 0.099370 0.101883 0.099323 0.147399 0.158197 0.159828 0.146353 0.178909
qa: 0.1991 -0.1284 0.0282 -0.0661 -0.0400 0.0582 -0.0764 -0.1458 -0.1996 -0.2007 -0.1242 -0.1248 -0.0864 -0.2878 -0.2866 -0.2891 -0.1521 -0.1525 -0.1515 -0.2534 -0.2378 0.2552 0.1502 0.1753 0.1424 0.1460 0.1451 0.1365 0.1413 0.1406 0.1437 0.1445 0.1599 0.1432 0.1013 0.0985 0.0999 0.0985 0.1019 0.1025 0.0994 0.1019 0.0993 0.1474 0.1582 0.1598 0.1464 0.1789
va: 3.6320 3.7983 3.4536 3.9262 3.8930 4.0376 3.8722 3.9282 3.9307 3.8622 3.9362 3.8960 3.8750 3.8942 3.8944 3.8990 3.8589 3.9541 3.9147 4.0771 3.9978 3.6317 1.0068 0.9752 0.9985 1.0004 1.0022 1.0171 0.9962 0.9950 0.9907 1.0043 0.9901 1.0050 1.0058 1.0036 1.0059 1.0032 1.0055 1.0052 1.0062 1.0054 1.0033 1.0056 0.9936 0.9902 0.9986 0.9960
dispersion: -0.021870429 hartree
energy: -870.528701220427 hartree
dipole: -13.57543 17.33459 3.75917 -13.06341 11.07482 -1.98859 -6.50762 5.96570 -0.54192
magnitude: 4.28713 au
magnitude: 10.89702 debye
