program: Orca
programVersion: 5.0.2
elementType: N C C C C C C C C C C C C C C C C C C C C C H H H H H H H H H H H H H H H H H H H H H H H H H H
charge: 1
multiplicity: 1
keywords: wb97x-d3
keywords: def2-TZVPP
keywords: def2/J RIJCOSX
keywords: DEFGRID2
keywords: scfconv7
keywords: smallprint printgap noloewdin
keywords: NOSOSCF
formula: C21H26N
InChI: InChI=1/C21H26N/c1-21(2,3)15-8-5-9-16-22(4)17-19-13-10-12-18-11-6-7-14-20(18)19/h5-7,9-14,22H,16-17H2,1-4H3
48 atoms
N  2.288387 -1.309417 -0.252584
C  2.001121 -0.834769 1.146174
C  2.347097 0.6088 1.34347
C  1.507417 1.641851 0.830351
C  1.899148 2.994687 1.020956
C  -4.674347 -1.755414 -1.105431
C  1.653977 -2.643246 -0.541487
C  3.485715 0.936674 2.034709
C  0.296004 1.388645 0.14117
C  3.740617 -1.341962 -0.544093
C  3.084745 3.284681 1.735404
C  3.856874 2.278692 2.240867
C  1.091893 4.032747 0.501773
C  -5.321113 -3.133967 -0.92457
C  -5.210474 -1.091979 -2.377939
C  -4.977424 -0.873585 0.111609
C  0.168787 -2.589803 -0.399592
C  -0.46658 2.415051 -0.346178
C  -0.063458 3.752525 -0.173011
C  -3.223689 -1.921393 -1.220563
C  -0.620817 -2.206294 -1.4072
C  -2.0292 -2.075295 -1.301263
H  2.581041 -1.474623 1.809921
H  0.947135 -1.023528 1.342685
H  1.948555 -2.902401 -1.557592
H  2.104681 -3.360246 0.143858
H  4.113919 0.148169 2.431791
H  -0.058471 0.375286 0.000277
H  3.882768 -1.651612 -1.575022
H  4.220495 -2.0492 0.126829
H  4.162912 -0.351834 -0.405074
H  3.368273 4.320305 1.879621
H  4.758819 2.504027 2.79418
H  1.404718 5.059128 0.651371
H  -6.403918 -3.027316 -0.836798
H  -4.957605 -3.628885 -0.02304
H  -5.115618 -3.785052 -1.775099
H  -6.291881 -0.964397 -2.302993
H  -4.766514 -0.107693 -2.532945
H  -5.004786 -1.698231 -3.261103
H  -4.603975 -1.323117 1.032671
H  -4.526758 0.114644 0.009971
H  -6.056039 -0.741916 0.215014
H  -0.261547 -2.854907 0.558285
H  -1.389695 2.195068 -0.866967
H  -0.674179 4.553902 -0.566947
H  -0.18111 -1.953512 -2.368682
H  1.868767 -0.644907 -0.907796
elementType: N C H
totalener: -870.50685742 hartree
nucrepener: 1676.41617603 hartree
electener: -2546.92303345 hartree
oneelecener: -4484.08375223 hartree
twoeener: 1937.16071878 hartree
cpcmener: -0.09603564 hartree
kineticenergy: 866.21209145 hartree
xcener: -89.066912336163 hartree
chargesum: 1.0000000
charge: 0.199900 -0.125641 0.026117 -0.066031 -0.039142 0.059756 -0.075475 -0.143934 -0.202762 -0.200790 -0.124790 -0.125178 -0.088463 -0.286790 -0.288484 -0.288627 -0.156096 -0.153700 -0.148521 -0.259756 -0.229774 0.253920 0.149654 0.174425 0.142097 0.146011 0.144864 0.140467 0.141491 0.140486 0.143617 0.145274 0.159719 0.144013 0.098857 0.101395 0.102180 0.098931 0.100712 0.101634 0.101133 0.100500 0.098810 0.147077 0.155619 0.160541 0.146726 0.178032
qa: 0.1999 -0.1256 0.0261 -0.0660 -0.0391 0.0598 -0.0755 -0.1439 -0.2028 -0.2008 -0.1248 -0.1252 -0.0885 -0.2868 -0.2885 -0.2886 -0.1561 -0.1537 -0.1485 -0.2598 -0.2298 0.2539 0.1497 0.1744 0.1421 0.1460 0.1449 0.1405 0.1415 0.1405 0.1436 0.1453 0.1597 0.1440 0.0989 0.1014 0.1022 0.0989 0.1007 0.1016 0.1011 0.1005 0.0988 0.1471 0.1556 0.1605 0.1467 0.1780
va: 3.6328 3.7966 3.4570 3.9208 3.8939 4.0384 3.8716 3.9289 3.9265 3.8630 3.9356 3.8973 3.8765 3.8925 3.8951 3.8942 3.8630 3.9550 3.9105 4.0749 3.9998 3.6342 1.0070 0.9757 0.9986 1.0004 1.0024 1.0138 0.9962 0.9952 0.9905 1.0040 0.9901 1.0048 1.0032 1.0055 1.0056 1.0032 1.0059 1.0056 1.0055 1.0062 1.0036 1.0058 0.9950 0.9896 0.9984 0.9966
dispersion: -0.021777768 hartree
energy: -870.528635187102 hartree
dipole: -13.95630 17.65411 3.69781 -13.53976 11.45621 -2.08355 -5.58342 5.23684 -0.34658
magnitude: 4.25853 au
magnitude: 10.82432 debye
