program: Orca
programVersion: 5.0.2
elementType: N C C C C C C C C C C C C C C C C C C C C C H H H H H H H H H H H H H H H H H H H H H H H H H H
charge: 1
multiplicity: 1
keywords: wb97x-d3
keywords: def2-TZVPP
keywords: def2/J RIJCOSX
keywords: DEFGRID2
keywords: scfconv7
keywords: smallprint printgap noloewdin
keywords: NOSOSCF
formula: C21H26N
InChI: InChI=1/C21H26N/c1-21(2,3)15-8-5-9-16-22(4)17-19-13-10-12-18-11-6-7-14-20(18)19/h5-7,9-14,22H,16-17H2,1-4H3
48 atoms
N  1.080597 -0.581462 0.691534
C  2.286158 -0.14141 1.480321
C  3.091647 0.881106 0.740103
C  2.620953 2.220356 0.601255
C  3.384381 3.132489 -0.176532
C  -5.426449 -2.956859 -1.217093
C  0.142686 -1.397189 1.537873
C  4.283506 0.514576 0.169255
C  1.426489 2.689776 1.200629
C  1.454992 -1.295827 -0.552176
C  4.604362 2.707863 -0.752314
C  5.052411 1.430495 -0.572989
C  2.915463 4.454086 -0.357311
C  -5.566509 -1.836844 -2.254374
C  -6.502956 -2.796173 -0.137239
C  -5.569203 -4.321486 -1.899614
C  -1.196203 -1.505858 0.899295
C  1.001611 3.977498 1.012669
C  1.745412 4.867907 0.215998
C  -4.103969 -2.864724 -0.593679
C  -1.725904 -2.665888 0.502714
C  -3.015114 -2.771547 -0.08149
H  2.871259 -1.03819 1.680221
H  1.917412 0.236308 2.433272
H  0.61275 -2.367253 1.698372
H  0.063884 -0.884178 2.497187
H  4.637836 -0.502942 0.282778
H  0.839529 2.042642 1.840884
H  2.006896 -2.194559 -0.287419
H  2.069056 -0.650077 -1.171838
H  0.553603 -1.560454 -1.096758
H  5.180413 3.415039 -1.33694
H  5.990313 1.11155 -1.00767
H  3.501852 5.136883 -0.960301
H  -4.804021 -1.914191 -3.030577
H  -5.480283 -0.852912 -1.791453
H  -6.544079 -1.897745 -2.735996
H  -6.417091 -1.834846 0.370752
H  -7.493687 -2.848645 -0.592562
H  -6.43631 -3.584062 0.61409
H  -4.816027 -4.459471 -2.67648
H  -5.470516 -5.137895 -1.183091
H  -6.552289 -4.402037 -2.3671
H  -1.758366 -0.584013 0.787397
H  0.088323 4.315407 1.484944
H  1.392886 5.880262 0.068649
H  -1.162351 -3.587018 0.623782
H  0.57236 0.262816 0.411332
elementType: N C H
totalener: -870.50799198 hartree
nucrepener: 1610.09435206 hartree
electener: -2480.60234404 hartree
oneelecener: -4351.46527754 hartree
twoeener: 1870.86293350 hartree
cpcmener: -0.09683400 hartree
kineticenergy: 866.20403621 hartree
xcener: -89.064906844026 hartree
chargesum: 1.0000000
charge: 0.193131 -0.100615 0.028698 -0.078622 -0.043500 0.059293 -0.054341 -0.124300 -0.232772 -0.208168 -0.126770 -0.128000 -0.082262 -0.287730 -0.286602 -0.288267 -0.179189 -0.140343 -0.149857 -0.262650 -0.191974 0.228840 0.148094 0.161289 0.139947 0.139425 0.143466 0.145743 0.141589 0.145566 0.148730 0.144551 0.159859 0.143933 0.101414 0.100208 0.098364 0.100709 0.098679 0.102185 0.101049 0.101444 0.098573 0.143458 0.158805 0.160607 0.144561 0.183753
qa: 0.1931 -0.1006 0.0287 -0.0786 -0.0435 0.0593 -0.0543 -0.1243 -0.2328 -0.2082 -0.1268 -0.1280 -0.0823 -0.2877 -0.2866 -0.2883 -0.1792 -0.1403 -0.1499 -0.2626 -0.1920 0.2288 0.1481 0.1613 0.1399 0.1394 0.1435 0.1457 0.1416 0.1456 0.1487 0.1446 0.1599 0.1439 0.1014 0.1002 0.0984 0.1007 0.0987 0.1022 0.1010 0.1014 0.0986 0.1435 0.1588 0.1606 0.1446 0.1838
va: 3.6257 3.8080 3.4964 3.9098 3.8931 4.0362 3.8759 3.9127 3.9436 3.8691 3.9332 3.8973 3.8751 3.8935 3.8940 3.8937 3.9186 3.9345 3.9174 4.0741 4.0136 3.6616 1.0037 0.9849 1.0027 0.9982 1.0028 1.0057 0.9963 0.9903 0.9943 1.0042 0.9902 1.0046 1.0056 1.0060 1.0036 1.0057 1.0033 1.0057 1.0053 1.0057 1.0034 1.0119 0.9924 0.9895 0.9997 0.9880
dispersion: -0.020324729 hartree
energy: -870.528316705755 hartree
dipole: -23.20412 24.98118 1.77706 -16.93853 16.00507 -0.93346 -5.21919 6.18799 0.96880
magnitude: 2.22887 au
magnitude: 5.66533 debye
