program: Orca
programVersion: 5.0.2
elementType: N C C C C C C C C C C C C C C C C C C C C C H H H H H H H H H H H H H H H H H H H H H H H H H H
charge: 1
multiplicity: 1
keywords: wb97x-d3
keywords: def2-TZVPP
keywords: def2/J RIJCOSX
keywords: DEFGRID2
keywords: scfconv7
keywords: smallprint printgap noloewdin
keywords: NOSOSCF
formula: C21H26N
InChI: InChI=1/C21H26N/c1-21(2,3)15-8-5-9-16-22(4)17-19-13-10-12-18-11-6-7-14-20(18)19/h5-7,9-14,22H,16-17H2,1-4H3
48 atoms
N  2.163092 -1.206462 -0.548616
C  3.320659 -0.372388 -0.068707
C  2.894421 0.725047 0.857412
C  2.124292 1.831804 0.393002
C  1.666257 2.786859 1.340739
C  -4.800419 -2.09482 -1.214752
C  1.379976 -1.839393 0.568328
C  3.228847 0.638737 2.184964
C  1.788911 2.029333 -0.968829
C  2.620582 -2.208905 -1.541264
C  2.029438 2.651897 2.701005
C  2.811145 1.611155 3.112354
C  0.859152 3.864019 0.908891
C  -4.870318 -3.423029 -1.974755
C  -5.180928 -0.938057 -2.146559
C  -5.753255 -2.129134 -0.014394
C  0.03308 -2.268739 0.087041
C  1.009361 3.085384 -1.357413
C  0.527591 4.007293 -0.40951
C  -3.434488 -1.886164 -0.728792
C  -1.006059 -1.430047 0.152534
C  -2.310724 -1.714428 -0.323024
H  3.812775 0.005553 -0.965315
H  4.009631 -1.054765 0.427867
H  1.979187 -2.666845 0.946678
H  1.280675 -1.095288 1.355906
H  3.817988 -0.201603 2.532044
H  2.167476 1.362641 -1.73403
H  3.325337 -2.883663 -1.062308
H  3.101689 -1.694823 -2.368757
H  1.766353 -2.767569 -1.913516
H  1.681568 3.39196 3.411321
H  3.098373 1.516049 4.150897
H  0.508555 4.578651 1.643524
H  -5.885838 -3.589523 -2.338243
H  -4.600972 -4.262924 -1.333358
H  -4.200933 -3.425489 -2.835885
H  -4.511222 -0.880353 -3.005464
H  -6.195811 -1.082844 -2.520771
H  -5.148547 0.019974 -1.626356
H  -6.77758 -2.28399 -0.358292
H  -5.501835 -2.939644 0.6706
H  -5.72347 -1.192467 0.543522
H  -0.079102 -3.260204 -0.333972
H  0.766577 3.216417 -2.403843
H  -0.093498 4.833246 -0.72963
H  -0.862283 -0.443164 0.587189
H  1.51279 -0.585241 -1.037412
elementType: N C H
totalener: -870.50585771 hartree
nucrepener: 1666.32032420 hartree
electener: -2536.82618191 hartree
oneelecener: -4463.95142459 hartree
twoeener: 1927.12524268 hartree
cpcmener: -0.09507485 hartree
kineticenergy: 866.21214307 hartree
xcener: -89.065871200247 hartree
chargesum: 1.0000000
charge: 0.177085 -0.097830 0.070877 -0.114909 -0.046350 0.061861 -0.095846 -0.119577 -0.244233 -0.179331 -0.121563 -0.131713 -0.079564 -0.288684 -0.289175 -0.288062 -0.171964 -0.130870 -0.151450 -0.234257 -0.216935 0.227698 0.165501 0.144493 0.152454 0.152973 0.142009 0.149089 0.138271 0.136935 0.135631 0.145435 0.159847 0.144391 0.098484 0.101660 0.100079 0.101350 0.099101 0.101741 0.098413 0.102033 0.101157 0.151833 0.158510 0.160781 0.141889 0.180734
qa: 0.1771 -0.0978 0.0709 -0.1149 -0.0463 0.0619 -0.0958 -0.1196 -0.2442 -0.1793 -0.1216 -0.1317 -0.0796 -0.2887 -0.2892 -0.2881 -0.1720 -0.1309 -0.1515 -0.2343 -0.2169 0.2277 0.1655 0.1445 0.1525 0.1530 0.1420 0.1491 0.1383 0.1369 0.1356 0.1454 0.1598 0.1444 0.0985 0.1017 0.1001 0.1013 0.0991 0.1017 0.0984 0.1020 0.1012 0.1518 0.1585 0.1608 0.1419 0.1807
va: 3.6486 3.7936 3.4689 3.8765 3.8872 4.0303 3.8892 3.9056 3.9370 3.8608 3.9303 3.9016 3.8732 3.8956 3.8959 3.8975 3.8508 3.9298 3.9209 4.0717 3.9945 3.6991 0.9827 1.0016 1.0046 0.9961 1.0036 1.0049 0.9958 0.9959 0.9954 1.0038 0.9903 1.0045 1.0035 1.0053 1.0057 1.0054 1.0030 1.0054 1.0031 1.0054 1.0056 1.0019 0.9926 0.9895 0.9989 0.9997
dispersion: -0.021262825 hartree
energy: -870.527120535159 hartree
dipole: -15.75883 19.17449 3.41566 -16.37820 14.45847 -1.91973 -9.71838 8.81972 -0.89865
magnitude: 4.01991 au
magnitude: 10.21780 debye
