program: Orca
programVersion: 5.0.2
elementType: N C C C C C C C C C C C C C C C C C C C C C H H H H H H H H H H H H H H H H H H H H H H H H H H
charge: 1
multiplicity: 1
keywords: wb97x-d3
keywords: def2-TZVPP
keywords: def2/J RIJCOSX
keywords: DEFGRID2
keywords: scfconv7
keywords: smallprint printgap noloewdin
keywords: NOSOSCF
formula: C21H26N
InChI: InChI=1/C21H26N/c1-21(2,3)15-8-5-9-16-22(4)17-19-13-10-12-18-11-6-7-14-20(18)19/h5-7,9-14,22H,16-17H2,1-4H3
48 atoms
N  2.140136 -1.066829 -0.677579
C  3.304168 -0.303876 -0.10393
C  2.883992 0.708825 0.916672
C  2.15593 1.877886 0.545417
C  1.716221 2.759151 1.57052
C  -4.810318 -2.166105 -1.340003
C  1.381137 -1.848796 0.358162
C  3.19046 0.488377 2.235665
C  1.84096 2.207174 -0.796004
C  2.58198 -1.920003 -1.806594
C  2.052239 2.488077 2.917295
C  2.787074 1.384735 3.242673
C  0.952291 3.898938 1.230036
C  -5.622018 -2.966446 -0.314937
C  -4.732002 -2.937202 -2.662052
C  -5.467389 -0.80025 -1.570478
C  0.04137 -2.247055 -0.1635
C  1.097378 3.317325 -1.094313
C  0.637363 4.168643 -0.072545
C  -3.457182 -1.959309 -0.819393
C  -1.040263 -1.506027 0.096457
C  -2.340625 -1.777877 -0.398746
H  3.816433 0.150377 -0.952376
H  3.97396 -1.044089 0.331838
H  2.002515 -2.703156 0.626342
H  1.275589 -1.206814 1.230258
H  3.747483 -0.398801 2.51217
H  2.204093 1.601117 -1.617417
H  3.289961 -2.657057 -1.436215
H  3.055844 -1.294047 -2.557783
H  1.722772 -2.41813 -2.245947
H  1.717885 3.172361 3.687616
H  3.05032 1.184209 4.272638
H  0.617578 4.556953 2.022867
H  -6.636416 -3.122359 -0.686687
H  -5.690582 -2.44006 0.637895
H  -5.177318 -3.945184 -0.130494
H  -4.273373 -3.917334 -2.525068
H  -5.735625 -3.088754 -3.06367
H  -4.151209 -2.392061 -3.4072
H  -5.529979 -0.22607 -0.645213
H  -4.911832 -0.208597 -2.299275
H  -6.481537 -0.935433 -1.95089
H  -0.035187 -3.137644 -0.775678
H  0.868444 3.546908 -2.126858
H  0.045982 5.039414 -0.323089
H  -0.941255 -0.625417 0.726452
H  1.479974 -0.385596 -1.062552
elementType: N C H
totalener: -870.50648305 hartree
nucrepener: 1659.49025844 hartree
electener: -2529.99674148 hartree
oneelecener: -4450.31694589 hartree
twoeener: 1920.32020441 hartree
cpcmener: -0.09516783 hartree
kineticenergy: 866.20907694 hartree
xcener: -89.065215468505 hartree
chargesum: 1.0000000
charge: 0.176353 -0.094959 0.066016 -0.111094 -0.048385 0.059045 -0.087520 -0.122239 -0.240032 -0.177816 -0.123418 -0.129841 -0.079855 -0.286961 -0.287842 -0.289024 -0.176874 -0.134135 -0.151296 -0.242883 -0.200356 0.226764 0.164154 0.145092 0.151324 0.147513 0.142718 0.150086 0.138512 0.136814 0.135109 0.145684 0.159352 0.145210 0.098632 0.102194 0.101842 0.100640 0.099054 0.100745 0.101770 0.100982 0.098320 0.149887 0.158009 0.160655 0.141454 0.180604
qa: 0.1764 -0.0950 0.0660 -0.1111 -0.0484 0.0590 -0.0875 -0.1222 -0.2400 -0.1778 -0.1234 -0.1298 -0.0799 -0.2870 -0.2878 -0.2890 -0.1769 -0.1341 -0.1513 -0.2429 -0.2004 0.2268 0.1642 0.1451 0.1513 0.1475 0.1427 0.1501 0.1385 0.1368 0.1351 0.1457 0.1594 0.1452 0.0986 0.1022 0.1018 0.1006 0.0991 0.1007 0.1018 0.1010 0.0983 0.1499 0.1580 0.1607 0.1415 0.1806
va: 3.6500 3.7905 3.4677 3.8916 3.8897 4.0347 3.8897 3.9010 3.9388 3.8599 3.9302 3.9015 3.8730 3.8955 3.8945 3.8954 3.8686 3.9329 3.9215 4.0739 3.9997 3.6900 0.9827 1.0019 1.0037 1.0001 1.0036 1.0044 0.9954 0.9964 0.9959 1.0037 0.9904 1.0041 1.0032 1.0054 1.0055 1.0058 1.0035 1.0054 1.0056 1.0055 1.0033 1.0027 0.9929 0.9896 0.9997 0.9980
dispersion: -0.020992419 hartree
energy: -870.527475465251 hartree
dipole: -15.89944 19.27304 3.37360 -16.06120 14.34707 -1.71412 -11.22895 10.10380 -1.12515
magnitude: 3.94783 au
magnitude: 10.03459 debye
