program: Orca
programVersion: 5.0.2
elementType: N C C C C C C C C C C C C C C C C C C C C C H H H H H H H H H H H H H H H H H H H H H H H H H H
charge: 1
multiplicity: 1
keywords: wb97x-d3
keywords: def2-TZVPP
keywords: def2/J RIJCOSX
keywords: DEFGRID2
keywords: scfconv7
keywords: smallprint printgap noloewdin
keywords: NOSOSCF
formula: C21H26N
InChI: InChI=1/C21H26N/c1-21(2,3)15-8-5-9-16-22(4)17-19-13-10-12-18-11-6-7-14-20(18)19/h5-7,9-14,22H,16-17H2,1-4H3
48 atoms
N  2.024538 -1.162088 -0.517116
C  3.234304 -0.400007 -0.046834
C  2.888058 0.7435 0.856579
C  2.257542 1.921356 0.357854
C  1.896185 2.941439 1.279896
C  -4.931597 -2.349201 -1.17289
C  1.21069 -1.721828 0.615336
C  3.173071 0.638928 2.194528
C  1.971969 2.130346 -1.013626
C  2.422388 -2.209498 -1.488713
C  2.202319 2.785238 2.65179
C  2.840124 1.664109 3.099017
C  1.241602 4.103797 0.81164
C  -4.819578 -3.440676 -2.243012
C  -5.560545 -1.08919 -1.777191
C  -5.787635 -2.850028 -0.003834
C  -0.117054 -2.205472 0.136673
C  1.343088 3.270154 -1.437646
C  0.963184 4.264518 -0.516914
C  -3.59035 -2.025592 -0.682149
C  -1.190178 -1.409482 0.180084
C  -2.478179 -1.772261 -0.288359
H  3.756837 -0.075511 -0.946925
H  3.870857 -1.120674 0.465266
H  1.806869 -2.514771 1.066806
H  1.08403 -0.924125 1.344097
H  3.657262 -0.255816 2.567231
H  2.271073 1.403211 -1.758383
H  3.059701 -2.9333 -0.987238
H  2.962452 -1.744137 -2.308608
H  1.535955 -2.701244 -1.878351
H  1.926781 3.572968 3.342442
H  3.082124 1.550576 4.147307
H  0.966274 4.869939 1.526328
H  -5.812023 -3.699175 -2.616611
H  -4.364675 -4.34708 -1.841606
H  -4.219015 -3.106487 -3.090057
H  -4.968617 -0.709016 -2.610782
H  -6.560282 -1.316741 -2.151579
H  -5.651762 -0.294072 -1.036147
H  -5.36125 -3.746668 0.447804
H  -5.883366 -2.091789 0.77435
H  -6.789992 -3.096487 -0.358958
H  -0.191949 -3.212246 -0.256579
H  1.139927 3.409982 -2.491426
H  0.461158 5.157429 -0.865657
H  -1.091583 -0.405495 0.586396
H  1.416174 -0.508535 -1.018249
elementType: N C H
totalener: -870.50677392 hartree
nucrepener: 1651.91774162 hartree
electener: -2522.42451553 hartree
oneelecener: -4435.17078613 hartree
twoeener: 1912.74627060 hartree
cpcmener: -0.09596481 hartree
kineticenergy: 866.21011605 hartree
xcener: -89.065578885501 hartree
chargesum: 1.0000000
charge: 0.184800 -0.099726 0.054458 -0.109044 -0.045394 0.059268 -0.084588 -0.114597 -0.233217 -0.182460 -0.121697 -0.133281 -0.080751 -0.289611 -0.288552 -0.285795 -0.182584 -0.138457 -0.149928 -0.241939 -0.203211 0.226482 0.165425 0.147281 0.152664 0.146481 0.141546 0.146599 0.139771 0.137027 0.135296 0.145353 0.159740 0.144519 0.098269 0.100840 0.100968 0.101429 0.098849 0.101455 0.101691 0.101574 0.098533 0.152861 0.158192 0.160442 0.141898 0.181120
qa: 0.1848 -0.0997 0.0545 -0.1090 -0.0454 0.0593 -0.0846 -0.1146 -0.2332 -0.1825 -0.1217 -0.1333 -0.0808 -0.2896 -0.2886 -0.2858 -0.1826 -0.1385 -0.1499 -0.2419 -0.2032 0.2265 0.1654 0.1473 0.1527 0.1465 0.1415 0.1466 0.1398 0.1370 0.1353 0.1454 0.1597 0.1445 0.0983 0.1008 0.1010 0.1014 0.0988 0.1015 0.1017 0.1016 0.0985 0.1529 0.1582 0.1604 0.1419 0.1811
va: 3.6496 3.7791 3.4676 3.8964 3.8910 4.0331 3.8773 3.8983 3.9494 3.8608 3.9305 3.9033 3.8742 3.8958 3.8951 3.8948 3.8768 3.9363 3.9181 4.0781 4.0028 3.6939 0.9833 1.0014 1.0027 0.9998 1.0035 1.0057 0.9950 0.9959 0.9953 1.0039 0.9904 1.0045 1.0036 1.0057 1.0055 1.0054 1.0031 1.0056 1.0053 1.0057 1.0031 1.0000 0.9928 0.9896 0.9997 0.9965
dispersion: -0.020866178 hartree
energy: -870.527640094166 hartree
dipole: -16.80790 20.02563 3.21773 -17.73496 15.83569 -1.89927 -9.41126 8.55487 -0.85638
magnitude: 3.83333 au
magnitude: 9.74354 debye
