program: Orca
programVersion: 5.0.2
elementType: N C C C C C C C C C C C C C C C C C C C C C H H H H H H H H H H H H H H H H H H H H H H H H H H
charge: 1
multiplicity: 1
keywords: wb97x-d3
keywords: def2-TZVPP
keywords: def2/J RIJCOSX
keywords: DEFGRID2
keywords: scfconv7
keywords: smallprint printgap noloewdin
keywords: NOSOSCF
formula: C21H26N
InChI: InChI=1/C21H26N/c1-21(2,3)15-8-5-9-16-22(4)17-19-13-10-12-18-11-6-7-14-20(18)19/h5-7,9-14,22H,16-17H2,1-4H3
48 atoms
N  1.531907 -1.053066 0.283346
C  2.595377 -0.496906 1.19133
C  3.088935 0.836339 0.721516
C  2.280419 2.004114 0.855281
C  2.771438 3.233957 0.338901
C  -5.169487 -2.524303 -1.40851
C  0.807164 -2.200417 0.93345
C  4.328565 0.928053 0.141994
C  1.007057 2.002189 1.476554
C  2.065733 -1.411733 -1.051639
C  4.055023 3.279973 -0.253333
C  4.822898 2.1544 -0.3404
C  1.971576 4.396316 0.429608
C  -5.366016 -4.008306 -1.737336
C  -5.141221 -1.702784 -2.70318
C  -6.305076 -2.031466 -0.505209
C  -0.437836 -2.538283 0.18466
C  0.257227 3.14503 1.552188
C  0.737093 4.354297 1.015549
C  -3.893474 -2.359002 -0.710549
C  -1.611067 -1.999583 0.531639
C  -2.831191 -2.218858 -0.155198
H  3.399762 -1.231174 1.217606
H  2.16083 -0.443732 2.189071
H  1.508327 -3.033219 0.979291
H  0.573544 -1.884169 1.94894
H  4.939562 0.038404 0.047187
H  0.610433 1.09898 1.92396
H  2.529397 -0.539684 -1.502196
H  1.25126 -1.745248 -1.687927
H  2.798558 -2.206323 -0.936313
H  4.421127 4.225669 -0.634259
H  5.807691 2.194235 -0.78633
H  2.355265 5.324811 0.024434
H  -6.312662 -4.150014 -2.261756
H  -5.387953 -4.617301 -0.832833
H  -4.566974 -4.382674 -2.378593
H  -6.083342 -1.827394 -3.24024
H  -5.010023 -0.639646 -2.497417
H  -4.333596 -2.022783 -3.36267
H  -6.346606 -2.596006 0.427022
H  -6.187582 -0.975713 -0.257576
H  -7.263265 -2.152337 -1.013864
H  -0.368053 -3.214765 -0.658639
H  -0.711257 3.120009 2.034675
H  0.130145 5.24795 1.07629
H  -1.657835 -1.338161 1.393838
H  0.83214 -0.319234 0.137456
elementType: N C H
totalener: -870.50710541 hartree
nucrepener: 1628.87454386 hartree
electener: -2499.38164927 hartree
oneelecener: -4388.95132908 hartree
twoeener: 1889.56967981 hartree
cpcmener: -0.09613274 hartree
kineticenergy: 866.21041780 hartree
xcener: -89.065288416602 hartree
chargesum: 1.0000000
charge: 0.181111 -0.089002 0.031593 -0.073601 -0.042009 0.056438 -0.071206 -0.134182 -0.233608 -0.194137 -0.127635 -0.125673 -0.084201 -0.286263 -0.286662 -0.288787 -0.173279 -0.140983 -0.149052 -0.247233 -0.206856 0.230597 0.149065 0.158827 0.149673 0.135281 0.143486 0.144523 0.142943 0.140616 0.141203 0.144858 0.159769 0.144111 0.098420 0.102067 0.100598 0.098767 0.101785 0.101095 0.101785 0.101011 0.098382 0.153704 0.158037 0.160131 0.141566 0.182926
qa: 0.1811 -0.0890 0.0316 -0.0736 -0.0420 0.0564 -0.0712 -0.1342 -0.2336 -0.1941 -0.1276 -0.1257 -0.0842 -0.2863 -0.2867 -0.2888 -0.1733 -0.1410 -0.1491 -0.2472 -0.2069 0.2306 0.1491 0.1588 0.1497 0.1353 0.1435 0.1445 0.1429 0.1406 0.1412 0.1449 0.1598 0.1441 0.0984 0.1021 0.1006 0.0988 0.1018 0.1011 0.1018 0.1010 0.0984 0.1537 0.1580 0.1601 0.1416 0.1829
va: 3.6410 3.7965 3.4902 3.9045 3.8945 4.0380 3.8811 3.9213 3.9440 3.8677 3.9362 3.8951 3.8746 3.8934 3.8945 3.8940 3.8823 3.9382 3.9178 4.0780 4.0042 3.6836 1.0029 0.9868 1.0004 1.0033 1.0029 1.0055 0.9915 0.9959 0.9956 1.0040 0.9902 1.0046 1.0034 1.0055 1.0059 1.0033 1.0054 1.0056 1.0057 1.0054 1.0034 0.9998 0.9927 0.9896 1.0006 0.9917
dispersion: -0.020537565 hartree
energy: -870.527642975987 hartree
dipole: -19.67470 22.13620 2.46150 -17.05691 15.39323 -1.66368 -8.22643 8.50243 0.27600
magnitude: 2.98379 au
magnitude: 7.58418 debye
