program: Orca
programVersion: 5.0.2
elementType: N C C C C C C C C C C C C C C C C C C C C C H H H H H H H H H H H H H H H H H H H H H H H H H H
charge: 1
multiplicity: 1
keywords: wb97x-d3
keywords: def2-TZVPP
keywords: def2/J RIJCOSX
keywords: DEFGRID2
keywords: scfconv7
keywords: smallprint printgap noloewdin
keywords: NOSOSCF
formula: C21H26N
InChI: InChI=1/C21H26N/c1-21(2,3)15-8-5-9-16-22(4)17-19-13-10-12-18-11-6-7-14-20(18)19/h5-7,9-14,22H,16-17H2,1-4H3
48 atoms
N  1.467132 -0.586804 -0.611336
C  0.678217 0.521028 0.031512
C  1.522815 1.379891 0.922667
C  2.413507 2.354255 0.382065
C  3.21334 3.117154 1.276196
C  -5.2029 -3.369578 -0.441182
C  0.705526 -1.232912 -1.737412
C  1.430945 1.222543 2.282383
C  2.539334 2.60726 -1.005906
C  1.972933 -1.572278 0.375147
C  3.090401 2.913899 2.670237
C  2.211437 1.993183 3.16422
C  4.115062 4.076155 0.760054
C  -6.240443 -2.311944 -0.048601
C  -4.899791 -4.275344 0.757318
C  -5.732807 -4.2095 -1.609733
C  -0.51851 -1.942732 -1.277475
C  3.418838 3.545408 -1.475338
C  4.221353 4.285105 -0.586718
C  -3.966699 -2.70282 -0.856095
C  -1.744803 -1.502198 -1.572983
C  -2.936574 -2.165283 -1.182553
H  -0.121585 0.046799 0.597162
H  0.219864 1.090776 -0.776286
H  0.467975 -0.440213 -2.445828
H  1.405233 -1.920489 -2.214272
H  0.745094 0.489299 2.689467
H  1.926665 2.073732 -1.721976
H  1.14075 -1.98714 0.936951
H  2.662716 -1.079496 1.053045
H  2.495181 -2.362882 -0.157204
H  3.701382 3.506008 3.340961
H  2.111869 1.846793 4.231499
H  4.720941 4.646917 1.453387
H  -5.888998 -1.695575 0.779886
H  -7.1658 -2.798804 0.264616
H  -6.474635 -1.653292 -0.885816
H  -4.162177 -5.037512 0.5026
H  -4.516876 -3.702285 1.602842
H  -5.810368 -4.783401 1.080118
H  -5.956691 -3.588062 -2.477697
H  -5.012199 -4.969647 -1.913876
H  -6.652685 -4.71695 -1.31332
H  -0.390709 -2.864552 -0.721545
H  3.493692 3.724685 -2.540064
H  4.91438 5.020752 -0.973174
H  -1.862857 -0.587271 -2.147589
H  2.291002 -0.170123 -1.052466
elementType: N C H
totalener: -870.50732099 hartree
nucrepener: 1620.51117790 hartree
electener: -2491.01849888 hartree
oneelecener: -4372.37156456 hartree
twoeener: 1881.35306568 hartree
cpcmener: -0.09772373 hartree
kineticenergy: 866.20484688 hartree
xcener: -89.065775222439 hartree
chargesum: 1.0000000
charge: 0.206353 -0.094879 0.014324 -0.074884 -0.038462 0.061010 -0.068135 -0.129389 -0.238382 -0.215059 -0.121147 -0.135574 -0.086437 -0.287788 -0.289037 -0.288154 -0.176880 -0.141944 -0.149314 -0.244187 -0.192264 0.218596 0.151588 0.165192 0.139551 0.150870 0.144928 0.146778 0.137797 0.147557 0.148289 0.144526 0.158856 0.143779 0.101364 0.098725 0.101379 0.100013 0.101044 0.098227 0.102149 0.101566 0.099040 0.147039 0.157819 0.159821 0.140582 0.183156
qa: 0.2064 -0.0949 0.0143 -0.0749 -0.0385 0.0610 -0.0681 -0.1294 -0.2384 -0.2151 -0.1211 -0.1356 -0.0864 -0.2878 -0.2890 -0.2882 -0.1769 -0.1419 -0.1493 -0.2442 -0.1923 0.2186 0.1516 0.1652 0.1396 0.1509 0.1449 0.1468 0.1378 0.1476 0.1483 0.1445 0.1589 0.1438 0.1014 0.0987 0.1014 0.1000 0.1010 0.0982 0.1021 0.1016 0.0990 0.1470 0.1578 0.1598 0.1406 0.1832
va: 3.5999 3.7828 3.4722 3.9272 3.8898 4.0292 3.8816 3.9121 3.9607 3.8781 3.9306 3.9078 3.8761 3.8955 3.8956 3.8956 3.8480 3.9347 3.9162 4.0671 4.0001 3.6890 0.9966 0.9823 1.0028 0.9940 1.0020 1.0065 0.9908 0.9884 0.9932 1.0040 0.9911 1.0048 1.0051 1.0033 1.0056 1.0060 1.0052 1.0036 1.0056 1.0054 1.0030 1.0043 0.9928 0.9899 1.0014 0.9873
dispersion: -0.020662856 hartree
energy: -870.527983841178 hartree
dipole: -20.54780 22.85640 2.30860 -20.76897 19.69871 -1.07026 -2.51723 1.70267 -0.81457
magnitude: 2.67182 au
magnitude: 6.79123 debye
