program: Orca
programVersion: 5.0.2
elementType: N C C C C C C C C C C C C C C C C C C C C C H H H H H H H H H H H H H H H H H H H H H H H H H H
charge: 1
multiplicity: 1
keywords: wb97x-d3
keywords: def2-TZVPP
keywords: def2/J RIJCOSX
keywords: DEFGRID2
keywords: scfconv7
keywords: smallprint printgap noloewdin
keywords: NOSOSCF
formula: C21H26N
InChI: InChI=1/C21H26N/c1-21(2,3)15-8-5-9-16-22(4)17-19-13-10-12-18-11-6-7-14-20(18)19/h5-7,9-14,22H,16-17H2,1-4H3
48 atoms
N  3.280125 -1.054976 -0.787912
C  3.463017 -0.040586 0.313339
C  2.176997 0.448622 0.900283
C  1.308786 1.324562 0.185446
C  0.041475 1.633719 0.749912
C  -3.925102 -0.729099 -0.327472
C  2.316126 -2.156602 -0.458469
C  1.81455 -0.005167 2.14209
C  1.636642 1.892041 -1.069662
C  4.602555 -1.603204 -1.181566
C  -0.300496 1.122089 2.022836
C  0.576853 0.338012 2.715974
C  -0.863215 2.446829 0.029285
C  -4.905451 -1.888657 -0.530869
C  -3.959357 0.200966 -1.544949
C  -4.299468 0.055612 0.93546
C  0.900784 -1.740437 -0.664978
C  0.744776 2.687011 -1.738556
C  -0.524961 2.956936 -1.193484
C  -2.56594 -1.252192 -0.164777
C  -0.081472 -2.025182 0.191139
C  -1.429832 -1.636007 -0.025389
H  4.068681 0.757685 -0.114521
H  4.057744 -0.537914 1.077829
H  2.558386 -2.975941 -1.137751
H  2.518285 -2.489387 0.559105
H  2.482161 -0.664227 2.6833
H  2.609324 1.720765 -1.513465
H  4.478206 -2.221553 -2.065595
H  4.996273 -2.198485 -0.361894
H  5.276489 -0.780332 -1.40214
H  -1.269902 1.366524 2.439745
H  0.318135 -0.042496 3.694725
H  -1.830283 2.663466 0.467136
H  -5.91846 -1.49944 -0.649794
H  -4.902588 -2.566407 0.32352
H  -4.659723 -2.465482 -1.423266
H  -4.964541 0.605266 -1.67537
H  -3.271481 1.038922 -1.422696
H  -3.688405 -0.330277 -2.457843
H  -3.609854 0.884276 1.104695
H  -5.304923 0.46787 0.833036
H  -4.284532 -0.584506 1.818209
H  0.678744 -1.225967 -1.595183
H  1.018865 3.113023 -2.694671
H  -1.223084 3.578264 -1.738068
H  0.141036 -2.545144 1.117955
H  2.912967 -0.570456 -1.611203
elementType: N C H
totalener: -870.49612991 hartree
nucrepener: 1794.98366493 hartree
electener: -2665.47979484 hartree
oneelecener: -4721.85939131 hartree
twoeener: 2056.37959646 hartree
cpcmener: -0.11662185 hartree
kineticenergy: 866.22230936 hartree
xcener: -89.073299304195 hartree
chargesum: 1.0000000
charge: 0.196989 -0.097633 0.124444 -0.123374 0.034073 0.104181 -0.064413 -0.160068 -0.219229 -0.195618 -0.210698 -0.092028 -0.154617 -0.291320 -0.287354 -0.291407 -0.087853 -0.138986 -0.136416 -0.307122 -0.265143 0.237512 0.160851 0.142612 0.140116 0.141520 0.137004 0.148787 0.135781 0.142581 0.136107 0.148851 0.159455 0.160129 0.098456 0.101113 0.101507 0.099959 0.090550 0.102263 0.084020 0.102092 0.105099 0.137216 0.160345 0.162717 0.143959 0.182993
qa: 0.1970 -0.0976 0.1244 -0.1234 0.0341 0.1042 -0.0644 -0.1601 -0.2192 -0.1956 -0.2107 -0.0920 -0.1546 -0.2913 -0.2874 -0.2914 -0.0879 -0.1390 -0.1364 -0.3071 -0.2651 0.2375 0.1609 0.1426 0.1401 0.1415 0.1370 0.1488 0.1358 0.1426 0.1361 0.1489 0.1595 0.1601 0.0985 0.1011 0.1015 0.1000 0.0906 0.1023 0.0840 0.1021 0.1051 0.1372 0.1603 0.1627 0.1440 0.1830
va: 3.6444 3.8209 3.3903 3.8811 3.6319 3.9937 3.8957 3.9312 3.9320 3.8702 3.9079 3.8420 3.8484 3.8922 3.8966 3.8997 3.8058 3.9215 3.8917 4.0740 4.0165 3.6481 0.9861 0.9986 0.9935 0.9997 1.0043 1.0042 0.9944 0.9926 0.9944 1.0012 0.9892 0.9926 1.0030 1.0055 1.0055 1.0045 1.0094 1.0062 1.0108 1.0053 1.0055 1.0084 0.9904 0.9880 0.9998 0.9911
dispersion: -0.026904014 hartree
energy: -870.523033923058 hartree
dipole: -6.35397 12.06574 5.71177 -7.21370 5.44917 -1.76453 -5.27785 3.98050 -1.29735
magnitude: 6.11727 au
magnitude: 15.54886 debye
