program: Orca
programVersion: 5.0.2
elementType: N C C C C C C C C C C C C C C C C C C C C C H H H H H H H H H H H H H H H H H H H H H H H H H H
charge: 1
multiplicity: 1
keywords: wb97x-d3
keywords: def2-TZVPP
keywords: def2/J RIJCOSX
keywords: DEFGRID2
keywords: scfconv7
keywords: smallprint printgap noloewdin
keywords: NOSOSCF
formula: C21H26N
InChI: InChI=1/C21H26N/c1-21(2,3)15-8-5-9-16-22(4)17-19-13-10-12-18-11-6-7-14-20(18)19/h5-7,9-14,22H,16-17H2,1-4H3
48 atoms
N  2.257171 -1.242806 -0.289059
C  1.744803 -0.658192 0.997907
C  2.233675 0.735614 1.24487
C  1.661548 1.853522 0.568025
C  2.175935 3.150383 0.841373
C  -4.866205 -2.024508 -0.94415
C  1.534599 -2.514508 -0.632987
C  3.239028 0.934058 2.156872
C  0.598757 1.740373 -0.362054
C  3.723134 -1.458518 -0.2586
C  3.216784 3.305457 1.786394
C  3.733091 2.221883 2.436905
C  1.633737 4.271081 0.17107
C  -5.05376 -1.351131 -2.307065
C  -5.369597 -1.096415 0.167771
C  -5.639208 -3.346912 -0.905323
C  0.108482 -2.252497 -0.966224
C  0.094305 2.84428 -0.994996
C  0.618735 4.124204 -0.732979
C  -3.44287 -2.294299 -0.725495
C  -0.901053 -2.74626 -0.244994
C  -2.270431 -2.507133 -0.532134
H  2.075261 -1.333054 1.786417
H  0.657729 -0.703307 0.960941
H  2.0595 -2.939769 -1.488307
H  1.647492 -3.187804 0.216033
H  3.661869 0.081406 2.674048
H  0.157209 0.776229 -0.581227
H  4.040118 -1.838081 -1.225534
H  3.956776 -2.179343 0.520397
H  4.224518 -0.51686 -0.058722
H  3.593719 4.300471 1.989034
H  4.523583 2.343251 3.165087
H  2.038107 5.251976 0.388954
H  -4.70631 -1.992548 -3.117647
H  -4.509666 -0.40779 -2.362329
H  -6.111643 -1.140843 -2.472817
H  -6.430949 -0.888607 0.021833
H  -5.246923 -1.551362 1.151183
H  -4.835669 -0.145673 0.163705
H  -5.518607 -3.849108 0.055133
H  -6.703288 -3.157421 -1.056281
H  -5.303358 -4.026655 -1.68903
H  -0.087334 -1.641219 -1.841119
H  -0.717163 2.731682 -1.701711
H  0.211835 4.987323 -1.242774
H  -0.68651 -3.355388 0.62863
H  2.067406 -0.577995 -1.045292
elementType: N C H
totalener: -870.49995887 hartree
nucrepener: 1655.53106550 hartree
electener: -2526.03102436 hartree
oneelecener: -4442.31634220 hartree
twoeener: 1916.28531783 hartree
cpcmener: -0.11075823 hartree
kineticenergy: 866.21472370 hartree
xcener: -89.067549678652 hartree
chargesum: 1.0000000
charge: 0.211628 -0.126487 0.010699 -0.055801 -0.043327 0.066494 -0.054827 -0.135613 -0.210274 -0.201875 -0.126585 -0.135364 -0.100923 -0.293184 -0.290950 -0.291240 -0.163321 -0.162604 -0.149127 -0.270483 -0.219995 0.243574 0.150417 0.178932 0.142318 0.138607 0.145607 0.160355 0.141740 0.142455 0.140916 0.147446 0.160551 0.146587 0.101688 0.101709 0.098261 0.098177 0.101754 0.102290 0.101214 0.098462 0.101811 0.147972 0.158598 0.161394 0.147161 0.183167
qa: 0.2116 -0.1265 0.0107 -0.0558 -0.0433 0.0665 -0.0548 -0.1356 -0.2103 -0.2019 -0.1266 -0.1354 -0.1009 -0.2932 -0.2909 -0.2912 -0.1633 -0.1626 -0.1491 -0.2705 -0.2200 0.2436 0.1504 0.1789 0.1423 0.1386 0.1456 0.1604 0.1417 0.1425 0.1409 0.1474 0.1606 0.1466 0.1017 0.1017 0.0983 0.0982 0.1018 0.1023 0.1012 0.0985 0.1018 0.1480 0.1586 0.1614 0.1472 0.1832
va: 3.6239 3.7846 3.4525 3.8891 3.8927 4.0194 3.8711 3.9191 3.9334 3.8664 3.9236 3.8950 3.8755 3.8938 3.8958 3.8965 3.8769 3.9500 3.8990 4.0920 4.0009 3.6606 1.0080 0.9747 0.9952 1.0018 1.0022 0.9867 0.9961 0.9936 0.9906 1.0030 0.9897 1.0041 1.0052 1.0053 1.0031 1.0030 1.0054 1.0054 1.0054 1.0027 1.0054 1.0058 0.9930 0.9889 0.9985 0.9902
dispersion: -0.021031979 hartree
energy: -870.520990844841 hartree
dipole: -15.01223 18.82244 3.81021 -14.26850 12.15171 -2.11680 -5.69189 5.28095 -0.41094
magnitude: 4.37806 au
magnitude: 11.12814 debye
