program: Orca
programVersion: 5.0.2
elementType: N C C C C C C C C C C C C C C C C C C C C C H H H H H H H H H H H H H H H H H H H H H H H H H H
charge: 1
multiplicity: 1
keywords: wb97x-d3
keywords: def2-TZVPP
keywords: def2/J RIJCOSX
keywords: DEFGRID2
keywords: scfconv7
keywords: smallprint printgap noloewdin
keywords: NOSOSCF
formula: C21H26N
InChI: InChI=1/C21H26N/c1-21(2,3)15-8-5-9-16-22(4)17-19-13-10-12-18-11-6-7-14-20(18)19/h5-7,9-14,22H,16-17H2,1-4H3
48 atoms
N  2.225289 -1.224496 -0.292327
C  1.70782 -0.622479 0.98454
C  2.230432 0.757115 1.242028
C  1.707358 1.891611 0.553166
C  2.248341 3.173675 0.844151
C  -4.916372 -2.091366 -0.935006
C  1.495198 -2.493852 -0.626888
C  3.217243 0.92668 2.179803
C  0.667562 1.808774 -0.405562
C  3.689119 -1.454221 -0.249792
C  3.268471 3.298813 1.815985
C  3.739339 2.199963 2.47534
C  1.753201 4.310225 0.163973
C  -5.137685 -1.591144 -2.365845
C  -5.389092 -1.029948 0.065536
C  -5.692023 -3.394163 -0.71403
C  0.067907 -2.230055 -0.953799
C  0.208989 2.927321 -1.047859
C  0.758787 4.192564 -0.766792
C  -3.488168 -2.337933 -0.718343
C  -0.937819 -2.748094 -0.244505
C  -2.310197 -2.522921 -0.529612
H  2.006094 -1.305212 1.779176
H  0.620468 -0.63807 0.928701
H  2.014117 -2.924856 -1.483197
H  1.609965 -3.164855 0.223828
H  3.603491 0.062174 2.705815
H  0.208886 0.856395 -0.640551
H  4.006331 -1.856501 -1.207534
H  3.912054 -2.1619 0.5443
H  4.199155 -0.513811 -0.066939
H  3.66578 4.283044 2.032034
H  4.51377 2.298329 3.224013
H  2.177297 5.279674 0.395312
H  -4.600548 -0.660125 -2.549882
H  -6.20033 -1.405481 -2.530815
H  -4.806166 -2.326041 -3.100035
H  -5.244064 -1.361218 1.094248
H  -4.851768 -0.090624 -0.068989
H  -6.452867 -0.834054 -0.079679
H  -5.371541 -4.170331 -1.409619
H  -5.556725 -3.769423 0.300792
H  -6.757968 -3.220206 -0.870356
H  -0.131461 -1.602359 -1.816265
H  -0.586162 2.838059 -1.77617
H  0.388131 5.067654 -1.283796
H  -0.717486 -3.378876 0.612226
H  2.047105 -0.567298 -1.057846
elementType: N C H
totalener: -870.49998694 hartree
nucrepener: 1650.98482947 hartree
electener: -2521.48481641 hartree
oneelecener: -4433.24290135 hartree
twoeener: 1911.75808494 hartree
cpcmener: -0.11104427 hartree
kineticenergy: 866.20946930 hartree
xcener: -89.066545502738 hartree
chargesum: 1.0000000
charge: 0.211854 -0.124371 0.003468 -0.050670 -0.045331 0.065302 -0.056438 -0.129391 -0.213341 -0.203022 -0.124427 -0.138528 -0.099827 -0.290585 -0.290403 -0.291343 -0.162570 -0.160435 -0.150698 -0.266767 -0.218534 0.238638 0.150259 0.178458 0.142675 0.138445 0.145337 0.159274 0.142211 0.142849 0.140978 0.147566 0.160578 0.146590 0.100863 0.098263 0.101351 0.101989 0.101936 0.098164 0.101557 0.101511 0.098321 0.148241 0.158786 0.161628 0.145955 0.183633
qa: 0.2119 -0.1244 0.0035 -0.0507 -0.0453 0.0653 -0.0564 -0.1294 -0.2133 -0.2030 -0.1244 -0.1385 -0.0998 -0.2906 -0.2904 -0.2913 -0.1626 -0.1604 -0.1507 -0.2668 -0.2185 0.2386 0.1503 0.1785 0.1427 0.1384 0.1453 0.1593 0.1422 0.1428 0.1410 0.1476 0.1606 0.1466 0.1009 0.0983 0.1014 0.1020 0.1019 0.0982 0.1016 0.1015 0.0983 0.1482 0.1588 0.1616 0.1460 0.1836
va: 3.6236 3.7792 3.4536 3.8829 3.8935 4.0207 3.8695 3.9170 3.9391 3.8668 3.9214 3.8979 3.8743 3.8936 3.8955 3.8959 3.8827 3.9473 3.8985 4.0858 4.0045 3.6686 1.0080 0.9752 0.9951 1.0019 1.0024 0.9881 0.9961 0.9936 0.9901 1.0029 0.9898 1.0041 1.0058 1.0031 1.0053 1.0054 1.0052 1.0031 1.0055 1.0054 1.0028 1.0060 0.9926 0.9888 0.9993 0.9902
dispersion: -0.020920154 hartree
energy: -870.520907097060 hartree
dipole: -15.39961 19.15626 3.75666 -14.59081 12.48906 -2.10175 -5.63901 5.22112 -0.41789
magnitude: 4.32487 au
magnitude: 10.99294 debye
