program: Orca
programVersion: 5.0.2
elementType: N C C C C C C C C C C C C C C C C C C C C C H H H H H H H H H H H H H H H H H H H H H H H H H H
charge: 1
multiplicity: 1
keywords: wb97x-d3
keywords: def2-TZVPP
keywords: def2/J RIJCOSX
keywords: DEFGRID2
keywords: scfconv7
keywords: smallprint printgap noloewdin
keywords: NOSOSCF
formula: C21H26N
InChI: InChI=1/C21H26N/c1-21(2,3)15-8-5-9-16-22(4)17-19-13-10-12-18-11-6-7-14-20(18)19/h5-7,9-14,22H,16-17H2,1-4H3
48 atoms
N  2.236379 -1.24861 -0.269282
C  1.760043 -0.64378 1.022649
C  2.272011 0.746706 1.24144
C  1.691825 1.865492 0.572908
C  2.231942 3.158091 0.816135
C  -4.907426 -2.051763 -0.968786
C  1.489791 -2.513668 -0.582635
C  3.309407 0.941037 2.117845
C  0.596712 1.757611 -0.319613
C  3.699155 -1.485746 -0.268054
C  3.305752 3.308652 1.724047
C  3.82914 2.224784 2.368421
C  1.681433 4.279636 0.15396
C  -5.155314 -2.05895 -2.481036
C  -5.284348 -0.683506 -0.388592
C  -5.742566 -3.147382 -0.297755
C  0.065408 -2.238937 -0.912556
C  0.084016 2.862461 -0.944095
C  0.63365 4.13781 -0.71247
C  -3.487318 -2.301796 -0.709464
C  -0.947533 -2.723139 -0.189601
C  -2.315735 -2.495156 -0.492009
H  2.101309 -1.313403 1.811143
H  0.671878 -0.677591 1.009951
H  1.999655 -2.964267 -1.434267
H  1.598988 -3.173701 0.277331
H  3.738218 0.088221 2.629716
H  0.137669 0.796735 -0.516089
H  3.990153 -1.878375 -1.237763
H  3.939205 -2.203472 0.511562
H  4.219602 -0.550745 -0.087791
H  3.702124 4.30052 1.903817
H  4.645183 2.342536 3.06834
H  2.105567 5.25717 0.348064
H  -4.567756 -1.289913 -2.983532
H  -6.209867 -1.863884 -2.682823
H  -4.900666 -3.023787 -2.920693
H  -5.114695 -0.647818 0.687948
H  -4.706236 0.117079 -0.851075
H  -6.34194 -0.485315 -0.570574
H  -5.495188 -4.13345 -0.692204
H  -5.58386 -3.162149 0.780959
H  -6.803362 -2.967694 -0.480291
H  -0.126402 -1.636758 -1.794593
H  -0.753414 2.754754 -1.620665
H  0.219664 5.00165 -1.215111
H  -0.7374 -3.326934 0.688706
H  2.038775 -0.587927 -1.027142
elementType: N C H
totalener: -870.50006605 hartree
nucrepener: 1652.93739472 hartree
electener: -2523.43746076 hartree
oneelecener: -4437.14258554 hartree
twoeener: 1913.70512478 hartree
cpcmener: -0.11087513 hartree
kineticenergy: 866.21181430 hartree
xcener: -89.066868321921 hartree
chargesum: 1.0000000
charge: 0.212737 -0.126879 0.016525 -0.057748 -0.042443 0.062807 -0.055181 -0.138012 -0.212181 -0.202183 -0.127376 -0.135160 -0.099876 -0.290207 -0.289665 -0.291498 -0.163834 -0.160909 -0.150058 -0.269108 -0.218919 0.242482 0.150541 0.177742 0.141733 0.138520 0.145927 0.159972 0.141703 0.142658 0.140655 0.147770 0.160588 0.146423 0.100923 0.098176 0.102016 0.101884 0.101741 0.098293 0.101726 0.101200 0.098007 0.148124 0.158981 0.161209 0.147021 0.183154
qa: 0.2127 -0.1269 0.0165 -0.0577 -0.0424 0.0628 -0.0552 -0.1380 -0.2122 -0.2022 -0.1274 -0.1352 -0.0999 -0.2902 -0.2897 -0.2915 -0.1638 -0.1609 -0.1501 -0.2691 -0.2189 0.2425 0.1505 0.1777 0.1417 0.1385 0.1459 0.1600 0.1417 0.1427 0.1407 0.1478 0.1606 0.1464 0.1009 0.0982 0.1020 0.1019 0.1017 0.0983 0.1017 0.1012 0.0980 0.1481 0.1590 0.1612 0.1470 0.1832
va: 3.6238 3.7877 3.4469 3.8905 3.8908 4.0247 3.8716 3.9197 3.9356 3.8669 3.9239 3.8951 3.8738 3.8919 3.8943 3.8946 3.8769 3.9484 3.8994 4.0901 3.9997 3.6654 1.0078 0.9753 0.9950 1.0019 1.0019 0.9875 0.9961 0.9934 0.9907 1.0029 0.9897 1.0041 1.0057 1.0032 1.0053 1.0055 1.0054 1.0030 1.0054 1.0054 1.0030 1.0057 0.9928 0.9889 0.9987 0.9901
dispersion: -0.020983376 hartree
energy: -870.521049424150 hartree
dipole: -15.27279 19.05823 3.78544 -14.49866 12.35895 -2.13971 -5.90271 5.49802 -0.40469
magnitude: 4.36712 au
magnitude: 11.10034 debye
