program: Orca
programVersion: 5.0.2
elementType: N C C C C C C C C C C C C C C C C C C C C C H H H H H H H H H H H H H H H H H H H H H H H H H H
charge: 1
multiplicity: 1
keywords: wb97x-d3
keywords: def2-TZVPP
keywords: def2/J RIJCOSX
keywords: DEFGRID2
keywords: scfconv7
keywords: smallprint printgap noloewdin
keywords: NOSOSCF
formula: C21H26N
InChI: InChI=1/C21H26N/c1-21(2,3)15-8-5-9-16-22(4)17-19-13-10-12-18-11-6-7-14-20(18)19/h5-7,9-14,22H,16-17H2,1-4H3
48 atoms
N  3.266313 -1.064853 -0.781167
C  3.455962 -0.090325 0.352878
C  2.173185 0.447885 0.900712
C  1.37541 1.372142 0.165679
C  0.102341 1.732531 0.68384
C  -4.005702 -0.85156 -0.25309
C  2.27192 -2.152123 -0.501745
C  1.741953 -0.005424 2.120137
C  1.782822 1.945228 -1.06386
C  4.581958 -1.636314 -1.163981
C  -0.31631 1.213825 1.930797
C  0.496546 0.381887 2.64671
C  -0.727293 2.608925 -0.052526
C  -4.012466 0.680772 -0.307972
C  -4.819645 -1.33177 0.952888
C  -4.60367 -1.42079 -1.54369
C  0.861967 -1.706185 -0.681668
C  0.961837 2.799986 -1.748938
C  -0.311852 3.127993 -1.247094
C  -2.619781 -1.308984 -0.120096
C  -0.106824 -2.011064 0.18321
C  -1.466083 -1.643679 -0.00131
H  4.114495 0.687515 -0.031024
H  3.996462 -0.635126 1.124622
H  2.494036 -2.945368 -1.217606
H  2.4693 -2.534525 0.499163
H  2.356767 -0.702248 2.676132
H  2.762841 1.734216 -1.472836
H  4.944015 -2.261481 -0.352587
H  5.280323 -0.825771 -1.349628
H  4.460043 -2.228552 -2.065552
H  -1.29111 1.493432 2.31128
H  0.17984 -0.002067 3.606841
H  -1.69814 2.867684 0.351776
H  -5.037322 1.043757 -0.404117
H  -3.442093 1.048562 -1.161665
H  -3.584938 1.111042 0.598766
H  -4.417357 -0.937284 1.886414
H  -5.853001 -0.992697 0.861432
H  -4.827155 -2.420311 1.019277
H  -4.617569 -2.51119 -1.527271
H  -5.631311 -1.072414 -1.661204
H  -4.036564 -1.100936 -2.418409
H  0.631959 -1.168138 -1.596155
H  1.297092 3.231489 -2.682716
H  -0.95267 3.798727 -1.8031
H  0.135294 -2.555344 1.090999
H  2.92854 -0.546726 -1.596028
elementType: N C H
totalener: -870.49644304 hartree
nucrepener: 1784.27445540 hartree
electener: -2654.77089844 hartree
oneelecener: -4700.48881855 hartree
twoeener: 2045.71792010 hartree
cpcmener: -0.11627304 hartree
kineticenergy: 866.23739883 hartree
xcener: -89.076058256158 hartree
chargesum: 1.0000000
charge: 0.196482 -0.093661 0.123201 -0.143886 0.045332 0.114589 -0.066752 -0.159204 -0.216534 -0.194451 -0.222504 -0.082265 -0.133253 -0.316288 -0.290923 -0.291776 -0.088081 -0.143811 -0.141882 -0.273302 -0.282457 0.218727 0.161404 0.141977 0.140738 0.141117 0.136537 0.149703 0.142268 0.136178 0.135574 0.146456 0.159516 0.157977 0.108328 0.100755 0.093978 0.100357 0.098758 0.101011 0.101702 0.098950 0.101364 0.139469 0.160004 0.161452 0.144353 0.182772
qa: 0.1965 -0.0937 0.1232 -0.1439 0.0453 0.1146 -0.0668 -0.1592 -0.2165 -0.1945 -0.2225 -0.0823 -0.1333 -0.3163 -0.2909 -0.2918 -0.0881 -0.1438 -0.1419 -0.2733 -0.2825 0.2187 0.1614 0.1420 0.1407 0.1411 0.1365 0.1497 0.1423 0.1362 0.1356 0.1465 0.1595 0.1580 0.1083 0.1008 0.0940 0.1004 0.0988 0.1010 0.1017 0.0989 0.1014 0.1395 0.1600 0.1615 0.1444 0.1828
va: 3.6434 3.8179 3.3848 3.8929 3.6404 3.9832 3.8932 3.9306 3.9344 3.8685 3.9097 3.8278 3.8579 3.9144 3.8925 3.8911 3.8047 3.9272 3.9148 4.0473 4.0183 3.7074 0.9856 0.9998 0.9929 1.0001 1.0044 1.0038 0.9930 0.9946 0.9948 1.0058 0.9890 0.9926 1.0067 1.0032 1.0053 1.0052 1.0030 1.0059 1.0057 1.0030 1.0052 1.0071 0.9908 0.9891 0.9994 0.9918
dispersion: -0.026217097 hartree
energy: -870.522660139745 hartree
dipole: -6.87612 12.53422 5.65810 -8.11345 6.29972 -1.81373 -4.88280 3.59088 -1.29192
magnitude: 6.08052 au
magnitude: 15.45546 debye
