program: Orca
programVersion: 5.0.2
elementType: N C C C C C C C C C C C C C C C C C C C C C H H H H H H H H H H H H H H H H H H H H H H H H H H
charge: 1
multiplicity: 1
keywords: wb97x-d3
keywords: def2-TZVPP
keywords: def2/J RIJCOSX
keywords: DEFGRID2
keywords: scfconv7
keywords: smallprint printgap noloewdin
keywords: NOSOSCF
formula: C21H26N
InChI: InChI=1/C21H26N/c1-21(2,3)15-8-5-9-16-22(4)17-19-13-10-12-18-11-6-7-14-20(18)19/h5-7,9-14,22H,16-17H2,1-4H3
48 atoms
N  1.075759 -0.225255 -0.64712
C  0.568089 1.042879 -0.018115
C  1.55701 1.630729 0.942679
C  2.718993 2.315557 0.47929
C  3.648339 2.805777 1.436523
C  -5.434212 -3.370867 -0.597742
C  0.248577 -0.642878 -1.832211
C  1.341245 1.49265 2.290103
C  2.994787 2.533124 -0.89301
C  1.237005 -1.320295 0.338006
C  3.387176 2.634316 2.815907
C  2.252856 2.000357 3.235139
C  4.819867 3.463415 0.995752
C  -5.380783 -4.642945 0.255394
C  -6.208003 -3.649064 -1.891596
C  -6.118576 -2.245849 0.185679
C  -1.15685 -0.973408 -1.471675
C  4.135047 3.17877 -1.288834
C  5.063555 3.642362 -0.337576
C  -4.069075 -2.956436 -0.929913
C  -1.610982 -2.229445 -1.500325
C  -2.945391 -2.601655 -1.191907
H  -0.358842 0.790551 0.494244
H  0.324588 1.725097 -0.832386
H  0.293272 0.188427 -2.536203
H  0.759502 -1.496773 -2.273998
H  0.454129 0.97657 2.636478
H  2.297873 2.20299 -1.653458
H  0.285431 -1.513372 0.824347
H  1.977928 -1.030732 1.076207
H  1.577188 -2.210726 -0.183108
H  4.100894 3.018545 3.534345
H  2.050963 1.877128 4.290606
H  5.522857 3.825238 1.736101
H  -4.833036 -4.476647 1.18347
H  -4.901197 -5.461672 -0.281854
H  -6.393996 -4.956008 0.512927
H  -5.742669 -4.448126 -2.469373
H  -7.226853 -3.956577 -1.650189
H  -6.264124 -2.760661 -2.521208
H  -5.587239 -2.027484 1.112637
H  -6.169454 -1.328395 -0.401476
H  -7.137698 -2.540019 0.44193
H  -1.820271 -0.15647 -1.211937
H  4.323247 3.336377 -2.342552
H  5.963985 4.144329 -0.665723
H  -0.933789 -3.034788 -1.771361
H  2.005256 -0.033176 -1.03025
elementType: N C H
totalener: -870.49868858 hartree
nucrepener: 1612.51794838 hartree
electener: -2483.01663696 hartree
oneelecener: -4356.24109083 hartree
twoeener: 1873.22445387 hartree
cpcmener: -0.11024322 hartree
kineticenergy: 866.21751767 hartree
xcener: -89.068340729064 hartree
chargesum: 1.0000000
charge: 0.211598 -0.084533 0.015746 -0.078009 -0.043091 0.065668 -0.060068 -0.130173 -0.231122 -0.220918 -0.133778 -0.132913 -0.088966 -0.290032 -0.289639 -0.291827 -0.185617 -0.144487 -0.156046 -0.264909 -0.193086 0.229604 0.144558 0.165947 0.144704 0.143977 0.146756 0.152420 0.140915 0.149278 0.148996 0.146916 0.160829 0.146588 0.101448 0.101526 0.098098 0.101976 0.098416 0.101972 0.101620 0.101220 0.097767 0.150328 0.159818 0.161883 0.143978 0.184664
qa: 0.2116 -0.0845 0.0157 -0.0780 -0.0431 0.0657 -0.0601 -0.1302 -0.2311 -0.2209 -0.1338 -0.1329 -0.0890 -0.2900 -0.2896 -0.2918 -0.1856 -0.1445 -0.1560 -0.2649 -0.1931 0.2296 0.1446 0.1659 0.1447 0.1440 0.1468 0.1524 0.1409 0.1493 0.1490 0.1469 0.1608 0.1466 0.1014 0.1015 0.0981 0.1020 0.0984 0.1020 0.1016 0.1012 0.0978 0.1503 0.1598 0.1619 0.1440 0.1847
va: 3.6025 3.8138 3.5050 3.9166 3.8763 4.0224 3.8854 3.9085 3.9510 3.8850 3.9286 3.8916 3.8677 3.8949 3.8949 3.8951 3.8699 3.9195 3.9070 4.0867 3.9854 3.6734 0.9971 0.9797 1.0004 0.9966 1.0013 1.0042 0.9895 0.9889 0.9935 1.0035 0.9898 1.0039 1.0052 1.0053 1.0031 1.0055 1.0028 1.0052 1.0052 1.0056 1.0034 1.0046 0.9921 0.9888 1.0012 0.9870
dispersion: -0.020614123 hartree
energy: -870.519302707514 hartree
dipole: -24.02305 25.68529 1.66224 -18.37280 17.88737 -0.48543 -3.67179 2.72436 -0.94743
magnitude: 1.97391 au
magnitude: 5.01727 debye
