program: Orca
programVersion: 5.0.2
elementType: N C C C C C C C C C C C C C C C C C C C C C H H H H H H H H H H H H H H H H H H H H H H H H H H
charge: 1
multiplicity: 1
keywords: wb97x-d3
keywords: def2-TZVPP
keywords: def2/J RIJCOSX
keywords: DEFGRID2
keywords: scfconv7
keywords: smallprint printgap noloewdin
keywords: NOSOSCF
formula: C21H26N
InChI: InChI=1/C21H26N/c1-21(2,3)15-8-5-9-16-22(4)17-19-13-10-12-18-11-6-7-14-20(18)19/h5-7,9-14,22H,16-17H2,1-4H3
48 atoms
N  1.424789 -0.545398 -0.708625
C  0.666093 0.588481 -0.080013
C  1.498793 1.365594 0.893433
C  2.486657 2.294478 0.451361
C  3.266759 2.974382 1.426557
C  -5.250761 -3.272679 -0.507634
C  0.653673 -1.161789 -1.843878
C  1.300757 1.171422 2.236926
C  2.728728 2.581102 -0.914633
C  1.879504 -1.550019 0.283001
C  3.02996 2.738251 2.800663
C  2.062302 1.861067 3.19893
C  4.265802 3.884127 1.009762
C  -4.914012 -4.262152 0.612718
C  -5.836834 -4.026201 -1.707343
C  -6.260521 -2.236715 -0.002173
C  -0.576557 -1.865537 -1.389986
C  3.699994 3.471289 -1.287111
C  4.484653 4.124966 -0.318008
C  -4.022222 -2.591674 -0.924156
C  -1.799432 -1.391302 -1.644073
C  -2.994622 -2.05115 -1.254623
H  -0.194445 0.147984 0.419711
H  0.294721 1.207702 -0.896173
H  0.424784 -0.355005 -2.538649
H  1.343026 -1.851172 -2.331669
H  0.543819 0.47046 2.566412
H  2.136307 2.114038 -1.691014
H  2.35374 -2.371566 -0.246977
H  1.028169 -1.913372 0.851842
H  2.599536 -1.091587 0.95291
H  3.627896 3.268402 3.53191
H  1.877031 1.687371 4.250253
H  4.856728 4.388492 1.764499
H  -4.49676 -3.75079 1.480769
H  -4.193053 -5.008771 0.278196
H  -5.817982 -4.784376 0.930532
H  -5.137729 -4.770361 -2.090179
H  -6.74977 -4.543171 -1.406816
H  -6.087489 -3.34419 -2.520398
H  -5.869492 -1.685662 0.853685
H  -6.517957 -1.518942 -0.781548
H  -7.177673 -2.738635 0.310486
H  -0.455168 -2.807928 -0.868657
H  3.864263 3.67696 -2.336624
H  5.253861 4.819727 -0.627735
H  -1.910281 -0.451864 -2.178507
H  2.268381 -0.158145 -1.13967
elementType: N C H
totalener: -870.49856787 hartree
nucrepener: 1621.75188564 hartree
electener: -2492.25045351 hartree
oneelecener: -4374.74840461 hartree
twoeener: 1882.49795111 hartree
cpcmener: -0.11073433 hartree
kineticenergy: 866.21500485 hartree
xcener: -89.067951060333 hartree
chargesum: 1.0000000
charge: 0.211006 -0.081673 -0.011033 -0.067225 -0.040814 0.072245 -0.061651 -0.116143 -0.229139 -0.216871 -0.124675 -0.144225 -0.094660 -0.291808 -0.291605 -0.292054 -0.177740 -0.149845 -0.152450 -0.259539 -0.197948 0.222964 0.150083 0.165161 0.140889 0.151029 0.145799 0.151181 0.149739 0.139067 0.145196 0.146968 0.160203 0.145659 0.101706 0.100243 0.098005 0.101758 0.098975 0.102152 0.102274 0.101578 0.098457 0.147625 0.159525 0.161070 0.144474 0.186069
qa: 0.2110 -0.0817 -0.0110 -0.0672 -0.0408 0.0722 -0.0617 -0.1161 -0.2291 -0.2169 -0.1247 -0.1442 -0.0947 -0.2918 -0.2916 -0.2921 -0.1777 -0.1498 -0.1525 -0.2595 -0.1979 0.2230 0.1501 0.1652 0.1409 0.1510 0.1458 0.1512 0.1497 0.1391 0.1452 0.1470 0.1602 0.1457 0.1017 0.1002 0.0980 0.1018 0.0990 0.1022 0.1023 0.1016 0.0985 0.1476 0.1595 0.1611 0.1445 0.1861
va: 3.6092 3.7830 3.5078 3.9111 3.8741 4.0162 3.8808 3.8961 3.9562 3.8798 3.9188 3.9064 3.8727 3.8953 3.8959 3.8946 3.8550 3.9222 3.9040 4.0763 3.9880 3.6819 0.9966 0.9823 1.0022 0.9937 1.0014 1.0050 0.9926 0.9893 0.9879 1.0032 0.9904 1.0043 1.0051 1.0059 1.0031 1.0053 1.0028 1.0054 1.0048 1.0055 1.0031 1.0037 0.9921 0.9891 1.0004 0.9856
dispersion: -0.020705582 hartree
energy: -870.519273448304 hartree
dipole: -20.93214 23.22821 2.29607 -20.26397 19.16447 -1.09950 -3.17571 2.13136 -1.04435
magnitude: 2.75164 au
magnitude: 6.99410 debye
