program: Orca
programVersion: 5.0.2
elementType: N C C C C C C C C C C C C C C C C C C C C C H H H H H H H H H H H H H H H H H H H H H H H H H H
charge: 1
multiplicity: 1
keywords: wb97x-d3
keywords: def2-TZVPP
keywords: def2/J RIJCOSX
keywords: DEFGRID2
keywords: scfconv7
keywords: smallprint printgap noloewdin
keywords: NOSOSCF
formula: C21H26N
InChI: InChI=1/C21H26N/c1-21(2,3)15-8-5-9-16-22(4)17-19-13-10-12-18-11-6-7-14-20(18)19/h5-7,9-14,22H,16-17H2,1-4H3
48 atoms
N  1.46833 -0.620464 -0.557433
C  0.680732 0.587141 -0.133309
C  1.456377 1.493238 0.772942
C  2.467595 2.363102 0.268374
C  3.179668 3.183747 1.184828
C  -5.217494 -3.37639 -0.341824
C  0.745643 -1.400086 -1.622279
C  1.17673 1.482182 2.115813
C  2.794926 2.457423 -1.106498
C  1.881276 -1.466509 0.588654
C  2.860324 3.134693 2.561725
C  1.875581 2.306072 3.017722
C  4.192978 4.045696 0.70615
C  -6.351835 -2.966574 -1.286116
C  -5.52917 -2.901683 1.082136
C  -5.052732 -4.900169 -0.355114
C  -0.506167 -2.03462 -1.128006
C  3.778108 3.305151 -1.5404
C  4.490863 4.104515 -0.626816
C  -3.965743 -2.756675 -0.784601
C  -1.712168 -1.644176 -1.5491
C  -2.924408 -2.253927 -1.131277
H  -0.209599 0.216944 0.371251
H  0.362027 1.087323 -1.04721
H  0.550206 -0.705098 -2.437359
H  1.453882 -2.151538 -1.971573
H  0.400955 0.826416 2.491458
H  2.259669 1.869772 -1.841462
H  2.588502 -0.918545 1.202018
H  2.357942 -2.363301 0.204275
H  1.009876 -1.730012 1.180467
H  3.408232 3.769001 3.247762
H  1.628168 2.274302 4.070041
H  4.728457 4.663028 1.416916
H  -6.490553 -1.885067 -1.294983
H  -7.287128 -3.424178 -0.95933
H  -6.15603 -3.293384 -2.307801
H  -4.734218 -3.177634 1.775611
H  -5.655085 -1.819286 1.12166
H  -6.455357 -3.362378 1.429691
H  -4.831246 -5.267281 -1.357667
H  -4.249283 -5.218824 0.309666
H  -5.976631 -5.373787 -0.018959
H  -0.414078 -2.862671 -0.435215
H  4.009319 3.362085 -2.5958
H  5.268488 4.765837 -0.984169
H  -1.794093 -0.820715 -2.252508
H  2.32861 -0.293517 -1.003829
elementType: N C H
totalener: -870.49861934 hartree
nucrepener: 1620.54349457 hartree
electener: -2491.04211391 hartree
oneelecener: -4372.35083518 hartree
twoeener: 1881.30872127 hartree
cpcmener: -0.11086077 hartree
kineticenergy: 866.22351076 hartree
xcener: -89.069518726185 hartree
chargesum: 1.0000000
charge: 0.211545 -0.079243 -0.019415 -0.059402 -0.042714 0.066556 -0.062982 -0.111179 -0.228500 -0.217954 -0.123526 -0.148430 -0.093483 -0.291100 -0.288711 -0.291443 -0.175053 -0.151144 -0.152805 -0.264957 -0.196749 0.227916 0.150423 0.164745 0.141046 0.150665 0.145939 0.148879 0.144838 0.151104 0.138617 0.146790 0.160531 0.146053 0.101313 0.098577 0.101292 0.101200 0.101809 0.098197 0.102059 0.101166 0.098577 0.147286 0.160067 0.161490 0.144851 0.185262
qa: 0.2115 -0.0792 -0.0194 -0.0594 -0.0427 0.0666 -0.0630 -0.1112 -0.2285 -0.2180 -0.1235 -0.1484 -0.0935 -0.2911 -0.2887 -0.2914 -0.1751 -0.1511 -0.1528 -0.2650 -0.1967 0.2279 0.1504 0.1647 0.1410 0.1507 0.1459 0.1489 0.1448 0.1511 0.1386 0.1468 0.1605 0.1461 0.1013 0.0986 0.1013 0.1012 0.1018 0.0982 0.1021 0.1012 0.0986 0.1473 0.1601 0.1615 0.1449 0.1853
va: 3.6082 3.7775 3.5044 3.8987 3.8754 4.0250 3.8828 3.8935 3.9599 3.8800 3.9174 3.9093 3.8715 3.8938 3.8938 3.8931 3.8582 3.9248 3.9051 4.0783 3.9870 3.6729 0.9963 0.9828 1.0021 0.9934 1.0014 1.0059 0.9874 0.9921 0.9895 1.0032 0.9905 1.0041 1.0055 1.0029 1.0054 1.0054 1.0056 1.0031 1.0054 1.0057 1.0031 1.0043 0.9920 0.9889 1.0005 0.9863
dispersion: -0.020663150 hartree
energy: -870.519282490363 hartree
dipole: -20.73300 23.09246 2.35945 -20.69291 19.49573 -1.19718 -1.48697 0.72595 -0.76102
magnitude: 2.75307 au
magnitude: 6.99776 debye
