program: Orca
programVersion: 5.0.2
elementType: Cl O O N N N C C C C C C C C C C C C C C H H H H H H H H H H H H H H H H H
charge: 1
multiplicity: 1
keywords: wb97x-d3
keywords: def2-TZVPP
keywords: def2/J RIJCOSX
keywords: DEFGRID2
keywords: scfconv7
keywords: smallprint printgap noloewdin
keywords: NOSOSCF
formula: C14H17ClN3O2
InChI: InChI=1/C14H17ClN3O2/c1-14(2,3)12(19)13(18-9-16-8-17-18)20-11-6-4-10(15)5-7-11/h4-9,13,17H,1-3H3
37 atoms
Cl 5.277039 0.962197 0.010403
O  -0.312932 -0.679284 -0.596412
O  -3.405681 -0.263312 -0.602303
N  -1.322896 1.306817 0.134168
N  -1.995161 1.920522 -0.85255
N  -0.725625 3.415852 0.099092
C  -2.732218 -2.302173 0.465233
C  -2.564589 -0.864721 0.017663
C  -1.218982 -0.153803 0.298891
C  -4.190795 -2.51045 0.88921
C  -2.424976 -3.186497 -0.760549
C  -1.80017 -2.675937 1.619034
C  1.009175 -0.298258 -0.422505
C  -0.537873 2.243873 0.669764
C  1.610596 0.430845 -1.433382
C  1.711774 -0.651806 0.719056
C  -1.637193 3.19366 -0.831814
C  2.9358 0.814545 -1.303024
C  3.033136 -0.257383 0.853602
C  3.640634 0.477703 -0.156311
H  -0.921198 -0.276913 1.345516
H  -4.88782 -2.293116 0.08262
H  -4.331689 -3.5518 1.177438
H  -4.459681 -1.894248 1.748056
H  -1.394909 -3.087232 -1.099606
H  -3.089113 -2.958428 -1.593532
H  -2.584586 -4.229342 -0.485994
H  -1.998618 -3.704557 1.917558
H  -1.961905 -2.058742 2.505638
H  -0.745418 -2.636449 1.342452
H  0.156239 2.034628 1.47009
H  1.05953 0.676811 -2.331879
H  1.259232 -1.25844 1.494657
H  -2.060049 3.932837 -1.495126
H  3.418692 1.373837 -2.092128
H  3.594283 -0.536474 1.734508
H  -2.76068 1.413575 -1.298607
totalener: -1318.44874234 hartree
nucrepener: 1720.05167500 hartree
electener: -3038.50041733 hartree
oneelecener: -5197.57449445 hartree
twoeener: 2159.07407711 hartree
kineticenergy: 1314.15955133 hartree
xcener: -103.854040772689 hartree
chargesum: 1.0000000
charge: -0.012865 -0.270589 -0.344235 0.069119 -0.043365 -0.264767 0.177325 0.233278 0.008646 -0.264358 -0.294068 -0.350980 0.218417 0.150284 -0.168358 -0.185996 0.185204 -0.090710 -0.120103 0.055637 0.139286 0.115448 0.108258 0.101149 0.113273 0.116796 0.111060 0.119805 0.110361 0.103593 0.178812 0.142692 0.136735 0.193699 0.142847 0.145233 0.233433
qa: -0.0129 -0.2706 -0.3442 0.0691 -0.0434 -0.2648 0.1773 0.2333 0.0086 -0.2644 -0.2941 -0.3510 0.2184 0.1503 -0.1684 -0.1860 0.1852 -0.0907 -0.1201 0.0556 0.1393 0.1154 0.1083 0.1011 0.1133 0.1168 0.1111 0.1198 0.1104 0.1036 0.1788 0.1427 0.1367 0.1937 0.1428 0.1452 0.2334
va: 1.2914 2.0279 2.1318 3.3428 3.4808 3.0584 3.7418 3.9677 4.0405 3.9144 3.9412 3.9243 3.6666 4.0186 3.9973 3.9589 3.9523 4.0026 4.0280 4.0429 0.9804 1.0131 1.0062 1.0057 1.0095 1.0076 1.0038 1.0130 1.0019 1.0029 0.9874 1.0079 1.0034 0.9771 1.0055 1.0077 1.0255
dispersion: -0.019761195 hartree
energy: -1318.468503531922 hartree
dipole: -28.07502 25.75435 -2.32067 -20.33442 20.99477 0.66035 4.88478 -4.70803 0.17675
magnitude: 2.41926 au
magnitude: 6.14926 debye
