program: Orca
programVersion: 5.0.2
elementType: Cl O O N N N C C C C C C C C C C C C C C H H H H H H H H H H H H H H H H H
charge: 1
multiplicity: 1
keywords: wb97x-d3
keywords: def2-TZVPP
keywords: def2/J RIJCOSX
keywords: DEFGRID2
keywords: scfconv7
keywords: smallprint printgap noloewdin
keywords: NOSOSCF
formula: C14H17ClN3O2
InChI: InChI=1/C14H17ClN3O2/c1-14(2,3)12(19)13(18-9-16-8-17-18)20-11-6-4-10(15)5-7-11/h4-9,13,17H,1-3H3
37 atoms
Cl 5.496647 -0.135065 0.275192
O  -0.269821 -0.232778 -0.761906
O  -3.226864 -0.297167 -1.065092
N  -1.558636 1.497904 0.117184
N  -1.819819 2.162897 -1.012662
N  -2.057413 3.557544 0.638418
C  -2.633611 -2.128517 0.3836
C  -2.471756 -0.768535 -0.25682
C  -1.243102 0.071748 0.167314
C  -1.297395 -2.871081 0.48435
C  -3.189109 -1.873241 1.79585
C  -3.629106 -2.960428 -0.418326
C  1.063639 -0.161294 -0.441358
C  -1.712534 2.373035 1.104239
C  1.569838 0.453738 0.692698
C  1.916769 -0.760455 -1.358751
C  -2.113552 3.402351 -0.676207
C  2.941831 0.456887 0.910973
C  3.282163 -0.750867 -1.142337
C  3.788865 -0.142558 -0.003075
H  -0.954114 -0.122235 1.203323
H  -1.473446 -3.843271 0.946169
H  -0.852015 -3.04939 -0.494815
H  -0.564709 -2.357872 1.10951
H  -3.342463 -2.831892 2.29356
H  -4.149037 -1.35612 1.764644
H  -2.507293 -1.290951 2.418315
H  -3.279937 -3.138398 -1.436594
H  -4.612072 -2.492828 -0.472665
H  -3.755341 -3.932004 0.060742
H  -1.561008 2.10418 2.13849
H  0.943047 0.941298 1.427153
H  1.512711 -1.238855 -2.241772
H  -2.359982 4.158387 -1.404613
H  3.334381 0.934816 1.798218
H  3.941392 -1.222918 -1.858195
H  -1.776715 1.724791 -1.929188
elementType: Cl O N C H
totalener: -1318.54693309 hartree
nucrepener: 1700.07453499 hartree
electener: -3018.62146809 hartree
oneelecener: -5156.64102295 hartree
twoeener: 2138.01955486 hartree
cpcmener: -0.11021265 hartree
kineticenergy: 1314.10409072 hartree
xcener: -103.846826697392 hartree
chargesum: 1.0000000
charge: -0.089029 -0.292585 -0.370649 0.085548 -0.026884 -0.352052 0.222705 0.217987 0.114474 -0.326080 -0.319201 -0.317564 0.312093 0.186415 -0.190069 -0.238822 0.201585 -0.170597 -0.102439 0.076233 0.174372 0.111068 0.113927 0.095734 0.109374 0.116641 0.105275 0.108876 0.101042 0.105619 0.198211 0.138669 0.147231 0.206628 0.145833 0.147872 0.252559
qa: -0.0890 -0.2926 -0.3706 0.0855 -0.0269 -0.3521 0.2227 0.2180 0.1145 -0.3261 -0.3192 -0.3176 0.3121 0.1864 -0.1901 -0.2388 0.2016 -0.1706 -0.1024 0.0762 0.1744 0.1111 0.1139 0.0957 0.1094 0.1166 0.1053 0.1089 0.1010 0.1056 0.1982 0.1387 0.1472 0.2066 0.1458 0.1479 0.2526
va: 1.2134 2.0524 2.1126 3.3542 3.5304 3.0485 3.7235 4.0269 3.8746 3.9501 3.9370 3.9294 3.6763 3.9814 3.9394 4.0193 3.9431 4.0335 3.9648 3.8588 0.9668 1.0047 1.0046 1.0053 1.0013 1.0051 1.0034 1.0041 1.0097 1.0045 0.9796 1.0106 1.0077 0.9711 1.0053 1.0018 0.9759
dispersion: -0.019129358 hartree
energy: -1318.566062450565 hartree
dipole: -27.41016 24.52664 -2.88352 -15.88336 17.49183 1.60847 4.73414 -4.51716 0.21698
magnitude: 3.30892 au
magnitude: 8.41060 debye
