program: Orca
programVersion: 5.0.2
elementType: Cl O O N N N C C C C C C C C C C C C C C H H H H H H H H H H H H H H H H H
charge: 1
multiplicity: 1
keywords: wb97x-d3
keywords: def2-TZVPP
keywords: def2/J RIJCOSX
keywords: DEFGRID2
keywords: scfconv7
keywords: smallprint printgap noloewdin
keywords: NOSOSCF
formula: C14H17ClN3O2
InChI: InChI=1/C14H17ClN3O2/c1-14(2,3)12(19)13(18-9-16-8-17-18)20-11-6-4-10(15)5-7-11/h4-9,13,17H,1-3H3
37 atoms
Cl 5.430397 0.46143 0.202863
O  -0.285541 -0.453947 -0.716672
O  -3.26362 -0.242233 -1.058182
N  -1.460599 1.272278 0.301634
N  -1.679101 2.066051 -0.752815
N  -1.545836 3.336912 1.007331
C  -2.791136 -2.294643 0.109647
C  -2.538923 -0.869925 -0.332085
C  -1.270856 -0.171899 0.210262
C  -3.41083 -2.197012 1.515956
C  -3.779215 -2.962784 -0.841715
C  -1.501089 -3.1171 0.174368
C  1.03681 -0.216496 -0.417216
C  -1.376125 2.076646 1.355335
C  1.561618 -0.256998 0.864896
C  1.856457 0.036108 -1.508173
C  -1.730763 3.303731 -0.304141
C  2.92053 -0.043606 1.052647
C  3.212044 0.240823 -1.320616
C  3.737436 0.201695 -0.037373
H  -1.051802 -0.490992 1.231385
H  -3.623824 -3.203949 1.877948
H  -2.741668 -1.727091 2.239192
H  -4.34823 -1.639496 1.505654
H  -3.96369 -3.984709 -0.508015
H  -3.388522 -3.014908 -1.859107
H  -4.740256 -2.449821 -0.871278
H  -1.023514 -3.208374 -0.801363
H  -1.747879 -4.123679 0.514245
H  -0.769497 -2.721771 0.881192
H  -1.188108 1.701961 2.349953
H  0.95473 -0.462305 1.736666
H  1.437216 0.067062 -2.505695
H  -1.901904 4.149667 -0.951027
H  3.32944 -0.07845 2.053265
H  3.849047 0.433737 -2.173122
H  -1.792906 1.710413 -1.69868
elementType: Cl O N C H
totalener: -1318.54629439 hartree
nucrepener: 1704.30172434 hartree
electener: -3022.84801873 hartree
oneelecener: -5165.08932089 hartree
twoeener: 2142.24130216 hartree
cpcmener: -0.10916171 hartree
kineticenergy: 1314.10597797 hartree
xcener: -103.846344646080 hartree
chargesum: 1.0000000
charge: -0.087507 -0.298423 -0.374457 0.082298 -0.021456 -0.351971 0.223200 0.209166 0.121487 -0.317381 -0.318288 -0.328133 0.287821 0.191745 -0.185568 -0.235590 0.201276 -0.150170 -0.101794 0.073850 0.169233 0.108977 0.106560 0.116763 0.105555 0.109410 0.100186 0.113122 0.109068 0.094995 0.197484 0.145814 0.148731 0.207011 0.147474 0.148033 0.251482
qa: -0.0875 -0.2984 -0.3745 0.0823 -0.0215 -0.3520 0.2232 0.2092 0.1215 -0.3174 -0.3183 -0.3281 0.2878 0.1917 -0.1856 -0.2356 0.2013 -0.1502 -0.1018 0.0738 0.1692 0.1090 0.1066 0.1168 0.1056 0.1094 0.1002 0.1131 0.1091 0.0950 0.1975 0.1458 0.1487 0.2070 0.1475 0.1480 0.2515
va: 1.2147 2.0381 2.1063 3.3497 3.5294 3.0482 3.7112 4.0441 3.8732 3.9388 3.9294 3.9513 3.6949 3.9788 3.9361 4.0396 3.9438 3.9915 3.9618 3.8634 0.9658 1.0010 1.0025 1.0056 1.0042 1.0036 1.0106 1.0059 1.0049 1.0048 0.9795 1.0051 1.0075 0.9710 1.0049 1.0015 0.9775
dispersion: -0.019123660 hartree
energy: -1318.565418048339 hartree
dipole: -28.58898 25.76292 -2.82606 -18.66705 19.78586 1.11881 2.74283 -2.32426 0.41857
magnitude: 3.06815 au
magnitude: 7.79862 debye
