program: Orca
programVersion: 5.0.2
elementType: Cl O O N N N C C C C C C C C C C C C C C H H H H H H H H H H H H H H H H H
charge: 1
multiplicity: 1
keywords: wb97x-d3
keywords: def2-TZVPP
keywords: def2/J RIJCOSX
keywords: DEFGRID2
keywords: scfconv7
keywords: smallprint printgap noloewdin
keywords: NOSOSCF
formula: C14H17ClN3O2
InChI: InChI=1/C14H17ClN3O2/c1-14(2,3)12(19)13(18-9-16-8-17-18)20-11-6-4-10(15)5-7-11/h4-9,13,17H,1-3H3
37 atoms
Cl 5.368357 0.604857 -0.35774
O  -0.370808 -0.473094 -0.863542
O  -3.33506 -0.168026 -0.717887
N  -1.301506 1.179537 0.488125
N  -1.680247 2.072353 -0.433811
N  -1.204804 3.169725 1.382143
C  -2.826622 -2.293373 0.289704
C  -2.554818 -0.865665 -0.124882
C  -1.180385 -0.256524 0.239296
C  -4.101783 -2.787272 -0.385019
C  -1.653728 -3.205772 -0.082207
C  -3.018119 -2.293738 1.815037
C  0.978065 -0.221474 -0.700817
C  -1.009044 1.880482 1.5779
C  1.734395 -0.924017 0.224147
C  1.559446 0.729971 -1.521296
C  -1.614073 3.26319 0.126067
C  3.090988 -0.664513 0.334258
C  2.918945 0.982694 -1.420781
C  3.67293 0.287029 -0.489479
H  -0.779667 -0.664954 1.17053
H  -4.022393 -2.766972 -1.47236
H  -4.287847 -3.820174 -0.088828
H  -4.974731 -2.201922 -0.096847
H  -1.461656 -3.207772 -1.155066
H  -1.9010 -4.226817 0.210148
H  -0.728344 -2.945291 0.432777
H  -3.835766 -1.640766 2.120989
H  -2.119731 -1.991266 2.354432
H  -3.261744 -3.306661 2.138324
H  -0.661311 1.411454 2.485537
H  1.285991 -1.681458 0.855361
H  0.96111 1.267853 -2.245435
H  -1.871765 4.167341 -0.402708
H  3.685213 -1.211197 1.053739
H  3.377907 1.721243 -2.063746
H  -1.967679 1.804708 -1.37135
elementType: Cl O N C H
totalener: -1318.54622240 hartree
nucrepener: 1710.15419043 hartree
electener: -3028.70041283 hartree
oneelecener: -5176.73306697 hartree
twoeener: 2148.03265414 hartree
cpcmener: -0.10841713 hartree
kineticenergy: 1314.12402994 hartree
xcener: -103.847172100256 hartree
chargesum: 1.0000000
charge: -0.085174 -0.317055 -0.375811 0.079971 -0.030348 -0.351087 0.218194 0.218955 0.144487 -0.317411 -0.326717 -0.323452 0.220434 0.192500 -0.168485 -0.180278 0.199918 -0.151976 -0.120049 0.086256 0.158382 0.108152 0.105217 0.101478 0.115729 0.108614 0.098542 0.117766 0.105876 0.108648 0.195196 0.158745 0.150584 0.205957 0.148322 0.147459 0.252457
qa: -0.0852 -0.3171 -0.3758 0.0800 -0.0303 -0.3511 0.2182 0.2190 0.1445 -0.3174 -0.3267 -0.3235 0.2204 0.1925 -0.1685 -0.1803 0.1999 -0.1520 -0.1200 0.0863 0.1584 0.1082 0.1052 0.1015 0.1157 0.1086 0.0985 0.1178 0.1059 0.1086 0.1952 0.1587 0.1506 0.2060 0.1483 0.1475 0.2525
va: 1.2169 2.0241 2.1003 3.3482 3.5274 3.0473 3.7236 4.0080 3.8901 3.9293 3.9515 3.9393 3.7728 3.9792 3.9607 3.9987 3.9466 4.0093 3.9773 3.8539 0.9723 1.0050 1.0048 1.0081 1.0052 1.0048 1.0018 1.0042 1.0026 1.0010 0.9812 0.9933 1.0051 0.9718 1.0041 1.0020 0.9781
dispersion: -0.019478776 hartree
energy: -1318.565701179524 hartree
dipole: -28.52929 25.97791 -2.55139 -19.14384 20.10392 0.96008 4.90932 -4.11135 0.79797
magnitude: 2.84044 au
magnitude: 7.21982 debye
