program: Orca
programVersion: 5.0.2
elementType: Cl O O N N N C C C C C C C C C C C C C C H H H H H H H H H H H H H H H H H
charge: 1
multiplicity: 1
keywords: wb97x-d3
keywords: def2-TZVPP
keywords: def2/J RIJCOSX
keywords: DEFGRID2
keywords: scfconv7
keywords: smallprint printgap noloewdin
keywords: NOSOSCF
formula: C14H17ClN3O2
InChI: InChI=1/C14H17ClN3O2/c1-14(2,3)12(19)13(18-9-16-8-17-18)20-11-6-4-10(15)5-7-11/h4-9,13,17H,1-3H3
37 atoms
Cl -5.472447 0.17022 0.382124
O  0.303746 0.318532 -0.596769
O  3.54894 -0.013829 -0.273699
N  1.489098 -1.570876 0.075846
N  1.70423 -2.11761 -1.125525
N  2.035722 -3.665802 0.370616
C  2.582774 2.129554 0.225965
C  2.576885 0.623429 0.038365
C  1.256897 -0.144794 0.2836
C  3.991042 2.559421 0.640354
C  2.243059 2.782859 -1.124549
C  1.582349 2.576134 1.294364
C  -1.034131 0.227103 -0.296801
C  1.71307 -2.53013 0.962406
C  -1.561378 -0.559591 0.715532
C  -1.866801 0.991913 -1.103282
C  2.019126 -3.380566 -0.923486
C  -2.934949 -0.570772 0.92291
C  -3.234205 0.974572 -0.898809
C  -3.761078 0.192719 0.118873
H  0.980485 -0.044516 1.339902
H  4.735186 2.326909 -0.120421
H  4.002286 3.639121 0.791518
H  4.297933 2.09027 1.576183
H  2.346206 3.86408 -1.022357
H  1.224283 2.577875 -1.449074
H  2.926184 2.456335 -1.909422
H  1.67605 3.653063 1.436475
H  1.778922 2.101129 2.257057
H  0.544733 2.383156 1.021258
H  1.625747 -2.361728 2.024529
H  -0.950118 -1.180836 1.356213
H  -1.445752 1.60324 -1.8910
H  2.223563 -4.061674 -1.733379
H  -3.344499 -1.184227 1.713487
H  -3.878187 1.573696 -1.52776
H  1.604657 -1.595235 -1.993206
elementType: Cl O N C H
totalener: -1318.54381622 hartree
nucrepener: 1704.05788740 hartree
electener: -3022.60170361 hartree
oneelecener: -5164.40993135 hartree
twoeener: 2141.80822774 hartree
cpcmener: -0.12569870 hartree
kineticenergy: 1314.09662204 hartree
xcener: -103.846410389417 hartree
chargesum: 1.0000000
charge: -0.097399 -0.314382 -0.387452 0.072085 -0.035020 -0.358722 0.242246 0.206569 0.183682 -0.322474 -0.318037 -0.349002 0.302723 0.188803 -0.169576 -0.235177 0.206428 -0.186278 -0.113341 0.086730 0.173600 0.098249 0.103624 0.111107 0.106107 0.106973 0.111612 0.106763 0.117805 0.104797 0.199893 0.142239 0.155508 0.207567 0.146741 0.147095 0.257912
qa: -0.0974 -0.3144 -0.3875 0.0721 -0.0350 -0.3587 0.2422 0.2066 0.1837 -0.3225 -0.3180 -0.3490 0.3027 0.1888 -0.1696 -0.2352 0.2064 -0.1863 -0.1133 0.0867 0.1736 0.0982 0.1036 0.1111 0.1061 0.1070 0.1116 0.1068 0.1178 0.1048 0.1999 0.1422 0.1555 0.2076 0.1467 0.1471 0.2579
va: 1.2049 2.0593 2.0913 3.3771 3.5138 3.0397 3.7086 4.0245 3.7660 3.9293 3.9394 3.9390 3.6976 3.9919 3.9493 4.0002 3.9444 4.0380 3.9761 3.8252 0.9714 1.0131 1.0040 1.0027 0.9999 1.0083 1.0054 1.0041 1.0001 1.0007 0.9790 1.0086 1.0013 0.9710 1.0049 1.0027 0.9679
dispersion: -0.019394781 hartree
energy: -1318.563210998382 hartree
dipole: 26.30741 -23.82281 2.48460 16.65177 -18.15092 -1.49916 1.11210 -1.66659 -0.55449
magnitude: 2.95435 au
magnitude: 7.50935 debye
