program: Orca
programVersion: 5.0.2
elementType: Cl O O N N N C C C C C C C C C C C C C C H H H H H H H H H H H H H H H H H
charge: 1
multiplicity: 1
keywords: wb97x-d3
keywords: def2-TZVPP
keywords: def2/J RIJCOSX
keywords: DEFGRID2
keywords: scfconv7
keywords: smallprint printgap noloewdin
keywords: NOSOSCF
formula: C14H17ClN3O2
InChI: InChI=1/C14H17ClN3O2/c1-14(2,3)12(19)13(18-9-16-8-17-18)20-11-6-4-10(15)5-7-11/h4-9,13,17H,1-3H3
37 atoms
Cl -5.477549 0.174808 0.060997
O  0.333927 0.244646 -0.709635
O  3.413483 0.127326 -0.675098
N  1.531184 -1.529464 0.227173
N  1.805096 -2.218358 -0.885267
N  1.947802 -3.598789 0.793827
C  2.639686 2.141757 0.389428
C  2.544859 0.696758 -0.066086
C  1.255369 -0.09415 0.262719
C  1.748364 3.017155 -0.50597
C  2.187211 2.272261 1.848145
C  4.089938 2.604607 0.260549
C  -1.01401 0.187248 -0.449587
C  1.627653 -2.394298 1.228711
C  -1.814809 0.884815 -1.344418
C  -1.58226 -0.513657 0.603323
C  2.046931 -3.460617 -0.520802
C  -3.189564 0.881634 -1.192086
C  -2.962458 -0.511345 0.75774
C  -3.756319 0.182705 -0.136691
H  0.917902 0.102549 1.283419
H  1.913247 4.061705 -0.237695
H  1.997829 2.901763 -1.561474
H  0.68666 2.811808 -0.375829
H  2.386458 3.288289 2.18981
H  2.727568 1.589928 2.506528
H  1.117957 2.098414 1.973573
H  4.442299 2.578144 -0.770435
H  4.765453 2.002622 0.869736
H  4.164999 3.636041 0.605936
H  1.457587 -2.104508 2.254013
H  -1.365003 1.431557 -2.162931
H  -0.998347 -1.078566 1.317135
H  2.287192 -4.2316 -1.234694
H  -3.806636 1.428094 -1.891958
H  -3.402378 -1.060147 1.578944
H  1.802937 -1.793788 -1.809417
elementType: Cl O N C H
totalener: -1318.54262723 hartree
nucrepener: 1699.69145886 hartree
electener: -3018.23408609 hartree
oneelecener: -5155.67518189 hartree
twoeener: 2137.44109580 hartree
cpcmener: -0.12495351 hartree
kineticenergy: 1314.08861635 hartree
xcener: -103.843832480311 hartree
chargesum: 1.0000000
charge: -0.097846 -0.306614 -0.388457 0.080165 -0.030421 -0.360116 0.228582 0.248487 0.145699 -0.332392 -0.360075 -0.318328 0.334511 0.187979 -0.246275 -0.200902 0.203324 -0.109614 -0.175498 0.079704 0.177181 0.108288 0.118653 0.104495 0.107272 0.123176 0.107077 0.100455 0.108868 0.103497 0.200799 0.153170 0.145216 0.207603 0.148121 0.146948 0.257268
qa: -0.0978 -0.3066 -0.3885 0.0802 -0.0304 -0.3601 0.2286 0.2485 0.1457 -0.3324 -0.3601 -0.3183 0.3345 0.1880 -0.2463 -0.2009 0.2033 -0.1096 -0.1755 0.0797 0.1772 0.1083 0.1187 0.1045 0.1073 0.1232 0.1071 0.1005 0.1089 0.1035 0.2008 0.1532 0.1452 0.2076 0.1481 0.1469 0.2573
va: 1.2044 2.0582 2.0899 3.3477 3.5237 3.0430 3.7110 4.0365 3.8355 3.9497 3.9433 3.9271 3.6811 3.9834 4.0086 3.9511 3.9425 3.9677 4.0265 3.8357 0.9676 1.0024 1.0017 1.0032 1.0021 0.9984 0.9990 1.0090 1.0035 1.0052 0.9787 1.0036 1.0086 0.9708 1.0018 1.0049 0.9707
dispersion: -0.019132625 hartree
energy: -1318.561759855937 hartree
dipole: 26.88369 -24.16792 2.71577 16.40757 -18.02806 -1.62049 4.14712 -3.98041 0.16670
magnitude: 3.16689 au
magnitude: 8.04958 debye
