program: Orca
programVersion: 5.0.2
elementType: Cl O O N N N C C C C C C C C C C C C C C H H H H H H H H H H H H H H H H H
charge: 1
multiplicity: 1
keywords: wb97x-d3
keywords: def2-TZVPP
keywords: def2/J RIJCOSX
keywords: DEFGRID2
keywords: scfconv7
keywords: smallprint printgap noloewdin
keywords: NOSOSCF
formula: C14H17ClN3O2
InChI: InChI=1/C14H17ClN3O2/c1-14(2,3)12(19)13(18-9-16-8-17-18)20-11-6-4-10(15)5-7-11/h4-9,13,16H,1-3H3
37 atoms
Cl 5.520093 -0.042201 -0.369053
O  -0.314132 -0.362726 -0.796389
O  -3.260206 -0.12335 -0.835875
N  -1.393588 1.410573 0.237288
N  -1.55503 2.087039 1.382538
N  -1.976096 3.353419 -0.337675
C  -2.76465 -2.100455 0.461114
C  -2.510196 -0.732737 -0.125787
C  -1.160842 -0.038039 0.230396
C  -3.92297 -2.770225 -0.273417
C  -1.51373 -2.98317 0.388323
C  -3.147463 -1.864523 1.934611
C  1.052647 -0.253449 -0.619424
C  -1.661811 2.151599 -0.813589
C  1.824985 -0.835833 -1.612771
C  1.646794 0.395382 0.450187
C  -1.906409 3.275786 1.021623
C  3.203152 -0.768976 -1.537234
C  3.032553 0.453841 0.52455
C  3.807194 -0.123699 -0.465674
H  -0.7905 -0.291411 1.228063
H  -4.124205 -3.741099 0.178846
H  -4.838773 -2.184085 -0.221321
H  -3.690753 -2.938009 -1.324762
H  -0.667874 -2.590398 0.955202
H  -1.188712 -3.149321 -0.638125
H  -1.747556 -3.956608 0.818793
H  -2.353821 -1.388427 2.513535
H  -3.346843 -2.827092 2.405796
H  -4.049561 -1.25997 2.026872
H  -1.616339 1.857229 -1.84893
H  1.3493 -1.344613 -2.440771
H  1.078068 0.864803 1.242588
H  -2.11078 4.095814 1.690067
H  3.807709 -1.224867 -2.308702
H  3.50221 0.954146 1.359614
H  -2.224108 4.163081 -0.889621
totalener: -1318.46295981 hartree
nucrepener: 1701.07726512 hartree
electener: -3019.54022493 hartree
oneelecener: -5160.87186880 hartree
twoeener: 2141.33164387 hartree
kineticenergy: 1314.17518417 hartree
xcener: -103.854986039644 hartree
chargesum: 1.0000000
charge: -0.027757 -0.277256 -0.307091 0.123858 -0.248731 -0.120777 0.138052 0.201361 0.038251 -0.263068 -0.288662 -0.301560 0.282002 0.184168 -0.222099 -0.183050 0.154016 -0.065936 -0.149230 0.047866 0.172491 0.106962 0.106313 0.105889 0.083679 0.115818 0.114181 0.096354 0.114787 0.120647 0.215479 0.136457 0.116737 0.193428 0.139996 0.134535 0.211892
qa: -0.0278 -0.2773 -0.3071 0.1239 -0.2487 -0.1208 0.1381 0.2014 0.0383 -0.2631 -0.2887 -0.3016 0.2820 0.1842 -0.2221 -0.1831 0.1540 -0.0659 -0.1492 0.0479 0.1725 0.1070 0.1063 0.1059 0.0837 0.1158 0.1142 0.0964 0.1148 0.1206 0.2155 0.1365 0.1167 0.1934 0.1400 0.1345 0.2119
va: 1.2763 2.0363 2.1675 3.4146 2.8848 3.5521 3.8509 3.9620 3.9728 3.9269 3.9437 3.9296 3.6848 3.9611 4.0647 3.9554 3.9227 3.9661 4.0682 4.0332 0.9733 1.0059 1.0109 1.0080 1.0094 1.0074 1.0077 1.0073 1.0048 1.0062 0.9806 1.0116 1.0185 0.9786 1.0058 1.0116 0.9903
dispersion: -0.018810523 hartree
energy: -1318.481770333339 hartree
dipole: -28.98186 26.22132 -2.76054 -13.80987 16.78213 2.97226 6.01087 -5.90865 0.10222
magnitude: 4.05775 au
magnitude: 10.31399 debye
