program: Orca
programVersion: 5.0.2
elementType: Cl O O N N N C C C C C C C C C C C C C C H H H H H H H H H H H H H H H H H H H
charge: 1
multiplicity: 1
keywords: wb97x-d3
keywords: def2-TZVPP
keywords: def2/J RIJCOSX
keywords: DEFGRID2
keywords: scfconv7
keywords: smallprint printgap noloewdin
keywords: NOSOSCF
formula: C14H19ClN3O2
InChI: InChI=1/C14H19ClN3O2/c1-14(2,3)12(19)13(18-9-16-8-17-18)20-11-6-4-10(15)5-7-11/h4-9,12-13,17,19H,1-3H3
39 atoms
Cl 5.353341 -1.062842 0.508852
O  -2.745273 0.569734 -1.671493
O  0.015547 0.724799 -1.112799
N  -1.205401 -0.701051 0.261232
N  -1.869725 -1.571393 -0.508489
N  -0.981568 -2.696838 1.131706
C  -3.261479 1.824578 0.386808
C  -2.208382 1.406888 -0.661237
C  -0.954624 0.702687 -0.129104
C  -2.621778 2.787278 1.391926
C  -4.371487 2.572617 -0.361986
C  -3.883693 0.640994 1.128512
C  -0.655229 -1.422732 1.234007
C  1.274664 0.313061 -0.71651
C  -1.735901 -2.763945 0.049072
C  2.036797 1.099469 0.133862
C  1.763688 -0.890164 -1.196997
C  3.297595 0.671066 0.514939
C  3.028102 -1.316122 -0.821275
C  3.788436 -0.537266 0.038816
H  -1.816107 2.329896 -1.107143
H  -0.622944 1.176521 0.799787
H  -3.385527 3.206161 2.046602
H  -1.893616 2.302968 2.045985
H  -2.127689 3.627909 0.900062
H  -5.093325 2.977623 0.346841
H  -4.929014 1.923376 -1.037914
H  -3.98139 3.41727 -0.934852
H  -4.319764 -0.092458 0.448946
H  -4.695027 0.994665 1.765019
H  -3.181287 0.132366 1.791423
H  -3.069316 1.088408 -2.412374
H  -0.027074 -0.989981 1.997788
H  -2.196865 -3.654938 -0.348805
H  1.673336 2.060667 0.477056
H  1.176381 -1.482254 -1.887429
H  3.904127 1.282948 1.167834
H  3.422125 -2.248587 -1.200591
H  -2.411492 -1.196138 -1.293003
totalener: -1319.66996401 hartree
nucrepener: 1768.99502697 hartree
electener: -3088.66499099 hartree
oneelecener: -5297.18945655 hartree
twoeener: 2208.52446557 hartree
kineticenergy: 1315.31026665 hartree
xcener: -104.297773833649 hartree
chargesum: 1.0000000
charge: -0.019470 -0.363415 -0.272359 0.067754 -0.055702 -0.262766 0.233138 0.043902 0.025075 -0.333670 -0.328977 -0.365607 0.144392 0.206335 0.179809 -0.175006 -0.175669 -0.115764 -0.101835 0.057513 0.138248 0.139792 0.115408 0.087214 0.117012 0.108948 0.102093 0.111688 0.105638 0.122615 0.089830 0.207002 0.178766 0.190469 0.143492 0.133136 0.142020 0.140015 0.238938
qa: -0.0195 -0.3634 -0.2724 0.0678 -0.0557 -0.2628 0.2331 0.0439 0.0251 -0.3337 -0.3290 -0.3656 0.1444 0.2063 0.1798 -0.1750 -0.1757 -0.1158 -0.1018 0.0575 0.1382 0.1398 0.1154 0.0872 0.1170 0.1089 0.1021 0.1117 0.1056 0.1226 0.0898 0.2070 0.1788 0.1905 0.1435 0.1331 0.1420 0.1400 0.2389
va: 1.2844 2.0528 2.0841 3.3316 3.4447 3.0508 3.6125 3.9504 4.0986 3.9359 3.9207 3.9422 3.9990 3.7355 3.9596 3.9704 3.9742 3.9961 3.9972 4.0325 1.0088 0.9841 1.0088 1.0035 1.0048 1.0115 1.0094 1.0004 1.0126 1.0138 1.0012 1.0306 0.9881 0.9783 1.0033 1.0098 1.0072 1.0064 1.0309
dispersion: -0.021930707 hartree
energy: -1319.691894717183 hartree
dipole: -38.82280 35.72703 -3.09576 17.70416 -17.64080 0.06337 2.54880 -2.94388 -0.39507
magnitude: 3.12151 au
magnitude: 7.93426 debye
