program: Gaussian 09
title: 000004839
version: EM64L-G09RevD.01
frameworkgroup: C1[X(C21H25NO2)]
method: RPBEPBE
basis: SDD
operation: Freq
keyword: #p
keyword: freq=noraman
keyword: PBEPBE/SDD
title: #p freq=noraman PBEPBE/SDD
converged: YES YES NO NO
title: Mulliken charges:
elementType: O O N C C C C C C C C C C C C C C C C C C C C C H H H H H H H H H H H H H H H H H H H H H H H H H
charge: -0.279303 -0.243178 -0.076148 0.019604 -0.462186 -0.431438 -0.402514 -0.347835 -0.296727 -0.701201 -0.539491 0.251403 0.469748 0.487844 -0.417167 -0.351834 -0.388228 -0.430976 -0.228745 -0.228178 -0.242422 -0.227902 -0.243453 -0.244052 0.250212 0.206747 0.229303 0.182751 0.256742 0.213068 0.200698 0.212056 0.168233 0.175709 0.212822 0.242593 0.230433 0.211850 0.213957 0.227562 0.251713 0.281415 0.230835 0.224229 0.225194 0.225477 0.225066 0.227752 0.227964
chargesum: 0.00000
title: Mulliken charges with hydrogens summed into heavy atoms:
elementType: O O N C C C C C C C C C C C C C C C C C C C C C
charge: -0.279303 -0.243178 -0.076148 0.269816 -0.026137 0.008055 0.011252 0.032454 0.091804 -0.044961 -0.296898 0.251403 0.469748 0.487844 -0.189605 -0.100121 -0.106813 -0.200141 -0.004516 -0.002985 -0.016944 -0.002837 -0.015702 -0.016088
polarizability: 2.50165035e+02 1.65407019e+01 2.36909338e+02 -7.43874368e+00 -5.08149063e+00 2.10779269e+02
1716.lowfreq: -10.1325 -6.8679 -1.8315 0.0004 0.0005 0.0007 8.5029 15.1109 24.0097
frequency: 5.2278 14.8493 23.7150 30.7161 45.3056 55.6078 61.3946 74.2418 102.9654 123.7824 136.3686 188.1598 200.5036 209.3543 224.1773 235.7715 241.6518 278.6559 284.4242 315.4735 324.6508 360.3899 393.5791 402.2499 404.7242 436.0369 442.4661 477.7918 486.2864 501.9078 543.9012 558.6829 614.6115 615.2213 637.0097 694.3272 703.8172 708.3708 722.5247 751.5283 754.3136 776.5075 801.1775 815.2140 846.3136 848.3533 858.1415 860.1975 868.8303 885.5222 909.3979 924.0755 932.3008 949.1077 955.5562 965.0229 971.6822 984.4673 989.9035 991.1910 993.1373 995.4692 1002.0269 1026.8716 1030.3419 1049.7762 1078.7763 1081.3219 1088.6284 1090.9296 1099.3401 1129.3053 1132.6504 1147.1053 1159.3171 1171.3784 1172.4320 1180.0872 1188.6631 1194.7225 1195.0642 1199.6313 1228.2160 1249.3192 1263.8758 1270.8898 1277.5371 1291.9798 1303.1578 1319.2062 1336.3962 1339.9192 1341.9459 1345.8922 1356.4871 1361.6737 1381.9289 1385.8767 1387.6486 1395.6444 1440.4357 1442.6407 1457.9451 1461.7300 1467.6125 1471.7485 1474.6947 1478.9138 1479.3404 1482.4544 1491.1350 1591.5796 1594.0564 1607.0861 1612.1431 1629.8722 2819.7404 2836.4694 2851.1807 2986.8795 2988.4728 2995.7543 3017.0947 3039.6878 3048.5499 3050.9864 3053.9696 3056.0458 3068.5544 3080.0124 3092.2605 3116.5379 3117.6513 3126.1325 3127.3878 3139.1694 3139.9135 3151.6660 3152.9889 3163.6429 3165.4068
redmass: 4.2492 4.4995 3.7988 3.8859 3.6861 3.0764 4.5696 3.7475 4.6188 2.1752 4.0685 5.0883 4.2377 2.7693 2.9914 1.5769 3.8825 4.4719 1.9884 7.0434 4.2551 2.5188 3.0034 2.7916 2.8722 5.0772 2.5402 3.4308 2.4403 3.2653 4.1547 3.2720 6.3781 6.3816 4.8705 3.9799 2.0367 1.8669 4.5402 2.4909 1.9207 2.5195 1.1488 3.3370 1.4568 2.2237 3.1492 1.4015 1.4841 2.8548 2.0262 1.8794 1.5458 2.0498 2.4748 2.5315 1.3973 1.3923 5.4486 5.6962 1.3628 1.8578 1.3175 2.2470 2.2318 2.0446 1.6579 2.1148 1.6267 2.2695 3.0215 2.1301 1.6874 1.4592 2.4604 1.1038 1.0733 2.5889 1.1622 2.1253 1.1688 2.1944 1.4868 1.4766 1.2424 1.2669 1.1806 1.3382 1.5782 1.2973 1.2838 1.4110 1.3775 1.3882 1.4476 1.5292 6.8286 6.2817 1.2538 1.4059 2.2017 2.1042 1.0871 1.0779 1.0892 1.0510 1.0822 1.2365 1.7373 2.2312 1.0734 6.1317 6.0564 6.0451 5.9578 9.2085 1.0714 1.0707 1.0697 1.0358 1.0614 1.0618 1.0878 1.0859 1.0842 1.0922 1.0885 1.0976 1.1005 1.0982 1.1004 1.0865 1.0862 1.0870 1.0872 1.0926 1.0925 1.0952 1.0955 1.1012 1.1008
irintensity: 0.4165 0.1684 0.0776 0.0238 0.2822 0.1546 0.4229 0.3811 1.3482 1.2631 0.7726 0.4280 1.3632 6.2197 1.3203 2.9678 0.6398 0.2493 1.5273 5.7444 3.7835 5.9018 4.4951 0.1332 0.1099 2.7057 2.5513 5.3285 0.8944 10.2250 9.3839 14.4682 0.7785 0.0588 15.7922 9.4951 42.6224 51.1639 25.0723 7.2054 33.6597 20.2790 4.0784 17.7218 1.2152 3.5221 0.7962 0.0364 4.7957 1.4222 5.6284 9.4521 14.8610 13.8668 39.2677 39.1031 0.3384 0.0454 0.5832 4.5363 0.6483 32.5582 0.3776 9.3745 7.0946 6.9042 16.3859 5.8935 35.5206 155.8497 364.9541 20.1389 10.7327 5.3392 34.0842 0.9943 0.8924 5.8998 1.7973 2.7496 0.6486 15.3479 5.4404 12.0640 10.9948 5.4499 10.9400 18.3717 62.0932 5.1038 16.0694 2.1824 3.2754 24.6265 5.2988 2.0637 2.7353 0.0325 10.8130 17.3360 18.4359 0.8149 12.0043 7.0654 3.7730 7.4637 9.6973 12.8092 27.2922 19.2501 11.7464 5.7097 1.2160 15.7903 7.5240 103.8591 67.4716 41.5171 178.6031 32.9523 19.7245 36.4709 15.4610 10.0686 4.1038 44.4122 37.6098 9.1443 53.9714 51.0510 36.3703 6.3252 4.9058 1.9480 0.9242 22.8313 29.9488 13.6942 30.0791 31.1027 16.5533
temp: 298.150 k
press: 1.00000 atm
elementType: 8 8 7 6 6 6 6 6 6 6 6 6 6 6 6 6 6 6 6 6 6 6 6 6 1 1 1 1 1 1 1 1 1 1 1 1 1 1 1 1 1 1 1 1 1 1 1 1 1
symmnumber: 1
zpe: 1078635.7 jmol-1
zpe.correction: 0.410831 hartree
zpe.thermalcorrener: 0.433349 hartree
zpe.thermalcorrenthalpy: 0.434293 hartree
zpe.thermalcorrgfe: 0.354058 hartree
zpe.sumelectzpe: -1018.662573 hartree
zpe.sumelectthermal: -1018.640056 hartree
zpe.sumelectthermalent: -1018.639111 hartree
zpe.sumelectthermalfe: -1018.719346 hartree
dipole: 1.1908 0.4423 -1.8948
dipole: 2.2812
quadrupole: -130.5096 -135.1239 -137.7368
quadrupole: 2.1128 -3.7100 0.3412
quadrupole: 3.9472 -0.6671 -3.2800 2.1128 -3.7100 0.3412
hfenergy: -1019.0734041 hartree
pointgroup: C01 [X(C21H25N1O2)]
dipole: 0.4140566 -0.2064408 0.769068 debye
polarizability: 244.4689536|-17.1894084|241.4665039|8.4294896|-8.1381549|211.9181847 unknown
InChI: InChI=1S/C21H25NO2/c1-2-22-15-9-14-19(16-22)24-21(23)20(17-10-5-3-6-11-17)18-12-7-4-8-13-18/h3-8,10-13,19-20H,2,9,14-16H2,1H3
charge 0 multiplicity 1
49 atoms
O  0.977809 0.785309 0.842731
O  0.241045 0.427323 -1.341646
N  4.384376 -0.535319 -0.138369
C  2.402273 0.850578 0.36525
C  3.176046 1.651445 1.416016
C  2.948632 -0.58385 0.229274
C  4.686343 1.610711 1.081828
C  5.176141 0.157826 0.908187
C  4.904591 -1.881368 -0.494845
C  6.279112 -1.841948 -1.187934
C  -1.383137 0.47051 0.548902
C  -0.005127 0.559106 -0.11985
C  -2.386462 1.498914 0.001293
C  -1.894952 -0.981021 0.444942
C  -3.352847 2.026842 0.896176
C  -2.367111 -1.511502 -0.781637
C  -2.414243 1.911786 -1.355097
C  -1.879104 -1.810276 1.59357
C  -4.329297 2.943476 0.449569
C  -2.819973 -2.846675 -0.853149
C  -3.389052 2.833473 -1.800819
C  -2.335019 -3.146547 1.523489
C  -4.351001 3.351224 -0.904459
C  -2.807795 -3.668886 0.298354
H  2.416387 1.340993 -0.624732
H  2.997071 1.196846 2.410561
H  2.804522 2.691249 1.454941
H  2.776117 -1.122336 1.198069
H  2.393544 -1.114344 -0.563853
H  4.878672 2.163072 0.142407
H  5.262587 2.105154 1.886322
H  6.238667 0.159762 0.610651
H  5.101545 -0.379276 1.892434
H  4.957021 -2.550012 0.404178
H  4.1716 -2.337052 -1.187366
H  -1.217411 0.688607 1.617689
H  6.249218 -1.154785 -2.051699
H  7.084876 -1.511365 -0.508463
H  6.547913 -2.850918 -1.550936
H  -3.343322 1.713018 1.947504
H  -2.380532 -0.88089 -1.67631
H  -1.665619 1.52386 -2.053587
H  -1.508006 -1.409673 2.545124
H  -5.067853 3.340178 1.155447
H  -3.18418 -3.246241 -1.806427
H  -3.3950 3.147078 -2.851004
H  -2.321414 -3.77555 2.42082
H  -5.105759 4.064757 -1.253834
H  -3.162991 -4.70396 0.240785
