program: Orca
programVersion: 5.0.2
elementType: Cl O O N N N C C C C C C C C C C C C C C H H H H H H H H H H H H H H H H H H H
charge: 1
multiplicity: 1
keywords: wb97x-d3
keywords: def2-TZVPP
keywords: def2/J RIJCOSX
keywords: DEFGRID2
keywords: scfconv7
keywords: smallprint printgap noloewdin
keywords: NOSOSCF
formula: C14H19ClN3O2
InChI: InChI=1/C14H19ClN3O2/c1-14(2,3)12(19)13(18-9-16-8-17-18)20-11-6-4-10(15)5-7-11/h4-9,12-13,17,19H,1-3H3
39 atoms
Cl 5.331742 -1.0203 0.69847
O  -2.623674 0.996284 -1.751477
O  0.059985 0.942547 -0.934897
N  -1.244556 -0.696971 0.072738
N  -1.884056 -1.379302 -0.884965
N  -1.114535 -2.828644 0.547329
C  -3.370098 1.682435 0.462792
C  -2.187383 1.544331 -0.516625
C  -0.968483 0.748411 -0.02857
C  -2.859188 2.243367 1.7933
C  -4.343772 2.695529 -0.151991
C  -4.123177 0.374213 0.716122
C  -0.766352 -1.609963 0.913775
C  1.302602 0.484867 -0.534843
C  -1.808675 -2.66078 -0.56441
C  1.990983 1.12606 0.483715
C  1.848504 -0.612936 -1.178306
C  3.236367 0.656978 0.86741
C  3.098914 -1.077134 -0.800806
C  3.785747 -0.444834 0.225599
H  -1.794455 2.556671 -0.672431
H  -0.693248 1.044073 0.98792
H  -2.254763 3.143036 1.655903
H  -3.700065 2.521876 2.427849
H  -2.271345 1.522655 2.366279
H  -5.178737 2.868467 0.526721
H  -4.758659 2.346529 -1.096558
H  -3.865499 3.661585 -0.326674
H  -4.503051 -0.074482 -0.202418
H  -4.993289 0.578289 1.340296
H  -3.533878 -0.367558 1.258412
H  -2.203671 1.455533 -2.485262
H  -0.173705 -1.35345 1.778848
H  -2.26535 -3.443069 -1.150956
H  1.583495 2.009267 0.96091
H  1.316681 -1.089506 -1.992057
H  3.786291 1.156914 1.652414
H  3.537873 -1.926618 -1.304961
H  -2.37599 -0.83414 -1.602329
totalener: -1319.67056487 hartree
nucrepener: 1768.49803639 hartree
electener: -3088.16860126 hartree
oneelecener: -5296.04658839 hartree
twoeener: 2207.87798713 hartree
kineticenergy: 1315.30865406 hartree
xcener: -104.296685935733 hartree
chargesum: 1.0000000
charge: -0.018206 -0.372499 -0.286238 0.088093 -0.058954 -0.260277 0.213048 0.069344 -0.006435 -0.336565 -0.302919 -0.364141 0.136820 0.207196 0.180939 -0.171765 -0.176520 -0.116637 -0.102020 0.057625 0.133380 0.140470 0.117682 0.117771 0.080504 0.107027 0.112527 0.100094 0.107849 0.122888 0.089311 0.221941 0.178275 0.191320 0.144351 0.131421 0.142697 0.140681 0.239924
qa: -0.0182 -0.3725 -0.2862 0.0881 -0.0590 -0.2603 0.2130 0.0693 -0.0064 -0.3366 -0.3029 -0.3641 0.1368 0.2072 0.1809 -0.1718 -0.1765 -0.1166 -0.1020 0.0576 0.1334 0.1405 0.1177 0.1178 0.0805 0.1070 0.1125 0.1001 0.1078 0.1229 0.0893 0.2219 0.1783 0.1913 0.1444 0.1314 0.1427 0.1407 0.2399
va: 1.2858 2.0687 2.0600 3.3016 3.4454 3.0464 3.6786 3.9006 4.1317 3.9369 3.9295 3.9508 4.0104 3.7252 3.9595 3.9760 3.9830 3.9984 4.0020 4.0325 1.0052 0.9781 1.0042 1.0106 1.0018 1.0079 1.0103 1.0052 1.0071 1.0152 0.9981 1.0234 0.9891 0.9781 1.0030 1.0094 1.0071 1.0063 1.0319
dispersion: -0.021979379 hartree
energy: -1319.692544245564 hartree
dipole: -38.98666 36.31767 -2.66898 15.95415 -15.94097 0.01318 2.74957 -3.32535 -0.57578
magnitude: 2.73042 au
magnitude: 6.94017 debye
