program: Orca
programVersion: 5.0.2
elementType: Cl O O N N N C C C C C C C C C C C C C C H H H H H H H H H H H H H H H H H H H
charge: 1
multiplicity: 1
keywords: wb97x-d3
keywords: def2-TZVPP
keywords: def2/J RIJCOSX
keywords: DEFGRID2
keywords: scfconv7
keywords: smallprint printgap noloewdin
keywords: NOSOSCF
formula: C14H19ClN3O2
InChI: InChI=1/C14H19ClN3O2/c1-14(2,3)12(19)13(18-9-16-8-17-18)20-11-6-4-10(15)5-7-11/h4-9,12-13,17,19H,1-3H3
39 atoms
Cl 5.618228 -0.781633 0.083252
O  -2.580323 1.015533 -1.611549
O  0.042352 0.808178 -0.766783
N  -1.304813 -0.795953 0.233109
N  -1.868799 -1.480924 -0.768751
N  -1.41003 -2.899139 0.814697
C  -3.380379 1.607072 0.594044
C  -2.164357 1.484702 -0.34658
C  -0.986619 0.633969 0.152694
C  -4.29559 2.683732 -0.001038
C  -4.185717 0.314365 0.74298
C  -2.915653 2.079629 1.972983
C  -1.025177 -1.68912 1.17528
C  1.318164 0.404178 -0.484562
C  -1.934843 -2.741543 -0.39171
C  2.141411 0.220392 -1.589119
C  1.819342 0.216862 0.795937
C  3.46625 -0.13715 -1.417933
C  3.146909 -0.152762 0.967018
C  3.962418 -0.326521 -0.136303
H  -1.738425 2.492504 -0.43091
H  -0.710126 0.923382 1.167217
H  -3.771036 3.634747 -0.120375
H  -4.695426 2.397166 -0.973879
H  -5.144573 2.858595 0.661555
H  -3.652052 -0.463654 1.29067
H  -4.509064 -0.094199 -0.215262
H  -5.090445 0.522616 1.317103
H  -3.778895 2.349345 2.582919
H  -2.276312 2.962955 1.905772
H  -2.371778 1.310137 2.52455
H  -2.03984 1.416376 -2.30176
H  -0.55073 -1.415192 2.104728
H  -2.364223 -3.512223 -1.011821
H  1.74747 0.367917 -2.586565
H  1.21867 0.36803 1.682553
H  4.101242 -0.271582 -2.282916
H  3.532069 -0.294927 1.967585
H  -2.239253 -0.98932 -1.583879
elementType: Cl O N C H
totalener: -1319.76708388 hartree
nucrepener: 1754.29263411 hartree
electener: -3074.05971799 hartree
oneelecener: -5266.52357889 hartree
twoeener: 2192.46386090 hartree
cpcmener: -0.10534754 hartree
kineticenergy: 1315.24706991 hartree
xcener: -104.289135158478 hartree
chargesum: 1.0000000
charge: -0.091518 -0.412791 -0.296275 0.073584 -0.028939 -0.347667 0.261090 0.106522 0.045644 -0.335667 -0.378155 -0.366162 0.185373 0.305212 0.204744 -0.252189 -0.209747 -0.104152 -0.157287 0.076962 0.127852 0.174708 0.100928 0.099353 0.099764 0.096854 0.109362 0.111640 0.106891 0.113881 0.093427 0.241107 0.198800 0.203957 0.146021 0.145273 0.146751 0.146101 0.258749
qa: -0.0915 -0.4128 -0.2963 0.0736 -0.0289 -0.3477 0.2611 0.1065 0.0456 -0.3357 -0.3782 -0.3662 0.1854 0.3052 0.2047 -0.2522 -0.2097 -0.1042 -0.1573 0.0770 0.1279 0.1747 0.1009 0.0994 0.0998 0.0969 0.1094 0.1116 0.1069 0.1139 0.0934 0.2411 0.1988 0.2040 0.1460 0.1453 0.1468 0.1461 0.2587
va: 1.2110 2.0264 2.0969 3.3155 3.4735 3.0540 3.6477 3.9485 4.0575 3.9206 3.9631 3.9490 3.9790 3.6959 3.9480 4.0352 3.9332 3.9637 4.0076 3.8545 1.0033 0.9584 1.0033 1.0151 1.0056 0.9970 1.0090 1.0076 1.0060 1.0024 1.0005 1.0001 0.9800 0.9731 1.0076 1.0033 1.0019 1.0057 0.9967
dispersion: -0.021334554 hartree
energy: -1319.788418437247 hartree
dipole: -39.77511 36.32940 -3.44571 14.77292 -14.97679 -0.20387 5.25655 -5.68182 -0.42527
magnitude: 3.47784 au
magnitude: 8.83996 debye
